1,3-Diphenyl-2-hydroxy-1-propen-3-one
- Formula: C15H12O2
- Molecular weight: 224.2546
- IUPAC Standard InChIKey: BZLYUDJOVAMKIB-KAMYIIQDSA-N
- CAS Registry Number: 54519-12-9
- Chemical structure:
View 3d structure (requires JavaScript / HTML 5) - Permanent link for this species. Use this link for bookmarking this species for future reference.

Condensed phase thermochemistry data

Data compiled by: Hussein Y. Afeefy, Joel F. Liebman, and Stephen E. Stein
Quantity | Value | Units | Method | Reference | Comment |
---|---|---|---|---|---|
ΔfH°solid | -231. | kJ/mol | Ccb | Moureu, 1930 | |
Quantity | Value | Units | Method | Reference | Comment |
ΔcH°solid | -7419.5 | kJ/mol | Ccb | Moureu, 1930 | Corresponding ΔfHºsolid = -198. kJ/mol (simple calculation by NIST; no Washburn corrections) |

References

Moureu, 1930
Moureu, M.H.,
Des sur la tautomerie des dicetones α,
Ann. Chem., 1930, 14, 283-405. [all data]