Pentanoic acid, octyl ester
- Formula: C13H26O2
- Molecular weight: 214.3443
- IUPAC Standard InChIKey: OUYCCOBIJYUMAK-UHFFFAOYSA-N
- CAS Registry Number: 5451-85-4
- Chemical structure:
View 3d structure (requires JavaScript / HTML 5) - Other names: Valeric acid, octyl ester; Octyl pentanoate; octyl valerate

Phase change data

Data compiled by: Thermodynamics Research Center, NIST Boulder Laboratories, Chris Muzny director
Quantity | Value | Units | Method | Reference | Comment |
---|---|---|---|---|---|
Tboil | 534.75 | K | N/A | Bilterys and Gisseleire, 1935 | Uncertainty assigned by TRC = 0.3 K |
Tboil | 533.4 | K | N/A | Gartenmeister, 1886 | Uncertainty assigned by TRC = 2. K |
Quantity | Value | Units | Method | Reference | Comment |
Tfus | 230.9 | K | N/A | Bilterys and Gisseleire, 1935 | Uncertainty assigned by TRC = 0.5 K |

Normal alkane RI, non-polar column, custom temperature program

Column type | Active phase | I | Reference | Comment |
---|---|---|---|---|
Capillary | SE-30 | 1474. | Vinogradov, 2004 | Program: not specified |

Normal alkane RI, polar column, custom temperature program

Column type | Active phase | I | Reference | Comment |
---|---|---|---|---|
Capillary | Carbowax 20M | 1719. | Vinogradov, 2004 | Program: not specified |

References

Bilterys and Gisseleire, 1935
Bilterys, R.; Gisseleire, J.,
Investigations on the Congelation Temperature of Organic Compounds,
Bull. Soc. Chim. Belg., 1935, 44, 567. [all data]
Gartenmeister, 1886
Gartenmeister, R.,
Investigation of the physical characterstics of liquid compounds: vi boiling point and specific volume of normal fatty acid esters,
Justus Liebigs Ann. Chem., 1886, 233, 249-315. [all data]