Benzene, 1,4-dichloro-2-ethyl-
- Formula: C8H8Cl2
- Molecular weight: 175.055
- IUPAC Standard InChIKey: PZPSDDYNMXBZOA-UHFFFAOYSA-N
- CAS Registry Number: 54484-63-8
- Chemical structure:
View 3d structure (requires JavaScript / HTML 5) - Other names: 2,5-Dichloroethylbenzene; Benzene, 1,4-dichloro-3-ethyl; Benzene, 2,5-dichloro-1-ethyl; Benzene, 2,4-dichloro-4-ethyl; 1,4-Dichloro-2-ethylbenzene; 2,5-Dichloro-1,4-dimethylbenzene

Phase change data

Data compiled as indicated in comments:
AC - William E. Acree, Jr., James S. Chickos
Enthalpy of vaporization
ΔvapH (kJ/mol) | Temperature (K) | Method | Reference | Comment |
---|---|---|---|---|
46.0 | 326. | A | Stephenson and Malanowski, 1987 | Based on data from 311. to 490. K. See also Stull, 1947 and Dykyj and Vanko, 1970.; AC |
Antoine Equation Parameters
log10(P) = A − (B / (T + C))
P = vapor pressure (bar)
T = temperature (K)
View plot Requires a JavaScript / HTML 5 canvas capable browser.
Temperature (K) | A | B | C | Reference | Comment |
---|---|---|---|---|---|
311.7 to 489.5 | 5.11518 | 2530.438 | 5.353 | Stull, 1947 | Coefficents calculated by NIST from author's data. |

Kovats' RI, non-polar column, isothermal

Column type | Active phase | Temperature (C) | I | Reference | Comment |
---|---|---|---|---|---|
Packed | E-301 | 140. | 1196. | Skobeleva and Shevchenko, 1976 | |
Packed | E-301 | 160. | 1213. | Skobeleva and Shevchenko, 1976 | |
Packed | E-301 | 140. | 1161. | Skobeleva and Shevchenko, 1976 | |
Packed | E-301 | 160. | 1180. | Skobeleva and Shevchenko, 1976 |

Kovats' RI, polar column, isothermal

Column type | Active phase | Temperature (C) | I | Reference | Comment |
---|---|---|---|---|---|
Packed | PEG-20M | 150. | 1658. | Skobeleva and Shevchenko, 1976 | Chromaton N AW DMCS; Column length: 4. m |
Packed | PEG-20M | 170. | 1689. | Skobeleva and Shevchenko, 1976 | Chromaton N AW DMCS; Column length: 4. m |

References

Stephenson and Malanowski, 1987
Stephenson, Richard M.; Malanowski, Stanislaw,
Handbook of the Thermodynamics of Organic Compounds, 1987, https://doi.org/10.1007/978-94-009-3173-2
. [all data]
Stull, 1947
Stull, Daniel R.,
Vapor Pressure of Pure Substances. Organic and Inorganic Compounds,
Ind. Eng. Chem., 1947, 39, 4, 517-540, https://doi.org/10.1021/ie50448a022
. [all data]
Dykyj and Vanko, 1970
Dykyj, J.; Vanko, A.,
Petrochemica, 1970, 10, 1, 3. [all data]
Skobeleva and Shevchenko, 1976
Skobeleva, V.D.; Shevchenko, N.A.,
Characteristics of gas-chromatographic separation and dissolution of chloroethylbenzenes in standard liquid phases,
Zh. Anal. Khim., 1976, 31, 1551-1554. [all data]