Hexadecane, 1-iodo-
- Formula: C16H33I
- Molecular weight: 352.3377
- IUPAC Standard InChIKey: KMWHQYDMBYABKL-UHFFFAOYSA-N
- CAS Registry Number: 544-77-4
- Chemical structure:

Phase change data

Data compiled as indicated in comments:
BS - Robert L. Brown and Stephen E. Stein
TRC - Thermodynamics Research Center, NIST Boulder Laboratories, Chris Muzny director
AC - William E. Acree, Jr., James S. Chickos
Quantity | Value | Units | Method | Reference | Comment |
---|---|---|---|---|---|
Tfus | 293. | K | N/A | Wibaut, Overhoff, et al., 1943 | Uncertainty assigned by TRC = 3. K; TRC |
Quantity | Value | Units | Method | Reference | Comment |
ΔvapH° | 99.6 | kJ/mol | A,E | Stephenson and Malanowski, 1987 | Based on data from 475. to 673. K. See also Li and Rossini, 1961, Dykyj and Vanko, 1970, and Bolotnikov and Neruchev, 2006.; AC |
Reduced pressure boiling point
Tboil (K) | Pressure (bar) | Reference | Comment |
---|---|---|---|
479.7 | 0.013 | Aldrich Chemical Company Inc., 1990 | BS |
Enthalpy of vaporization
ΔvapH (kJ/mol) | Temperature (K) | Method | Reference | Comment |
---|---|---|---|---|
73.0 | 490. | A,E | Stephenson and Malanowski, 1987 | Based on data from 475. to 673. K. See also Li and Rossini, 1961 and Dykyj and Vanko, 1970.; AC |

Van Den Dool and Kratz RI, non-polar column, custom temperature program

Data compiled by: NIST Mass Spectrometry Data Center, William E. Wallace, director

Column type Capillary
Active phase DB-1
Column length (m) 15.
Carrier gas He
Substrate
Column diameter (mm) 0.53
Phase thickness (μm) 1.
Program 40C(3min) => 8C/min => 200(1min) => 5C/min => 300C(25min)
I 2064.
ReferencePeng, 2000
Comment MSDC-RI

References

Wibaut, Overhoff, et al., 1943
Wibaut, J.P.; Overhoff, J.; Jonker, E.W.,
On the Preparation of Some Hydrocarbons of the Mixed Aliphatic-Aromatic and Aliphatic-Alicyclic Type Containing 22 to 30 C-atoms,
Recl. Trav. Chim. Pays-Bas, 1943, 62, 31. [all data]
Stephenson and Malanowski, 1987
Stephenson, Richard M.; Malanowski, Stanislaw,
Handbook of the Thermodynamics of Organic Compounds, 1987, https://doi.org/10.1007/978-94-009-3173-2
. [all data]
Li and Rossini, 1961
Li, J.C.M.; Rossini, F.D.,
Vapor Pressures and Boiling Points of the l-Fluoroalkanes, l-Chloroalkanes, l-Bromoalkanes, and l-Iodoalkanes, C 1 to C 20 .,
J. Chem. Eng. Data, 1961, 6, 2, 268-270, https://doi.org/10.1021/je60010a025
. [all data]
Dykyj and Vanko, 1970
Dykyj, J.; Vanko, A.,
Petrochemica, 1970, 10, 1, 3. [all data]
Bolotnikov and Neruchev, 2006
Bolotnikov, Mikhail F.; Neruchev, Yurij A.,
Enthalpies of vaporization of a series of the 1-iodoalkanes,
Fluid Phase Equilibria, 2006, 243, 1-2, 121-125, https://doi.org/10.1016/j.fluid.2006.02.006
. [all data]
Aldrich Chemical Company Inc., 1990
Aldrich Chemical Company Inc.,
Catalog Handbook of Fine Chemicals, Aldrich Chemical Company, Inc., Milwaukee WI, 1990, 1. [all data]