Butyl hexyl ether
- Formula: C10H22O
- Molecular weight: 158.2811
- IUPAC Standard InChIKey: QCYFOZWGXKXDJA-UHFFFAOYSA-N
- CAS Registry Number: 54459-71-1
- Chemical structure:
View 3d structure (requires JavaScript / HTML 5) - Other names: 1-butoxyhexane

Phase change data

Data compiled by: William E. Acree, Jr., James S. Chickos
Quantity | Value | Units | Method | Reference | Comment |
---|---|---|---|---|---|
ΔvapH° | 53.2 ± 0.1 | kJ/mol | C | Kusano, 1985 |

Kovats' RI, non-polar column, isothermal

Column type | Active phase | Temperature (C) | I | Reference | Comment |
---|---|---|---|---|---|
Packed | SE-30 | 120. | 1072. | Bierl, Beroza, et al., 1972 | Column length: 3.0 m |

References

Kusano, 1985
Kusano, Kazuhito,
Micro conduction calorimeters to measure enthalpies of vaporization,
Thermochimica Acta, 1985, 88, 1, 109-120, https://doi.org/10.1016/0040-6031(85)85418-6
. [all data]
Bierl, Beroza, et al., 1972
Bierl, B.A.; Beroza, M.; Aldridge, M.H.,
Effect of functional-group position on retention indices of six classes of compounds on four stationary phases,
J. Chromatogr. Sci., 1972, 10, 12, 712-715, https://doi.org/10.1093/chromsci/10.12.712
. [all data]