Anthracene-maleic anhydride Diels-Alder adduct
- Formula: C18H12O3
- Molecular weight: 276.2861
- IUPAC Standard InChIKey: PSKVQQJLLWSBFV-UHFFFAOYSA-N
- CAS Registry Number: 5443-16-3
- Chemical structure:
View 3d structure (requires JavaScript / HTML 5) - Other names: Anthracene, 2,5-furandione adduct; Anthracene,maleic anhydride adduct; endo-9,10-(α,β-Succinic anhydride)anthracene; 9,10(3',4')-Furanoanthracene-12,14-dione; 9,10-Dihydroanthraceno-9,10-endo-α,β-succinic anhydride; 9,10-Ethanoanthracene-11,12-dicarboxylic anhydride

Condensed phase thermochemistry data

Data compiled by: Hussein Y. Afeefy, Joel F. Liebman, and Stephen E. Stein
Quantity | Value | Units | Method | Reference | Comment |
---|---|---|---|---|---|
ΔfH°solid | -418.2 ± 6.4 | kJ/mol | Ccb | Kar, Lenz, et al., 1992 | |
Quantity | Value | Units | Method | Reference | Comment |
ΔcH°solid | -8380.0 ± 5.9 | kJ/mol | Ccb | Kar, Lenz, et al., 1992 | Corresponding ΔfHºsolid = -418.2 kJ/mol (simple calculation by NIST; no Washburn corrections) |

Reaction thermochemistry data

Data compiled by: Hussein Y. Afeefy, Joel F. Liebman, and Stephen E. Stein
Individual Reactions
By formula: C4H2O3 + C14H10 = C18H12O3
Quantity | Value | Units | Method | Reference | Comment |
---|---|---|---|---|---|
ΔrH° | -93. ± 2. | kJ/mol | Cm | Kiselev, Mavrin, et al., 1982 | liquid phase; solvent: Benzene |
ΔrH° | -93.7 | kJ/mol | Eqk | Lenz, Hegedus, et al., 1982 | liquid phase; solvent: 1,2,4-C6H3Cl3 |

References

Kar, Lenz, et al., 1992
Kar, M.; Lenz, T.G.; Vaughan, J.D.,
Thermodynamic measurements for the Diels-Alder adduct of anthracene and maleic anhydride,
J. Chem. Thermodyn., 1992, 24, 151-157. [all data]
Kiselev, Mavrin, et al., 1982
Kiselev, V.D.; Mavrin, G.V.; Konovalov, A.I.,
Thermodynamic principles of the occurrence of a Diels-Alder reaction in the presence of a Lewis acid,
Zh. Org. Khim., 1982, 18, 2505-2510. [all data]
Lenz, Hegedus, et al., 1982
Lenz, T.G.; Hegedus, L.S.; Vaughan, J.D.,
Liquid phase thermochemical energy conversion systems - an application of Diels-Alder chemistry,
Int. J. Energy Res., 1982, 6, 357-365. [all data]