Cyclohexanol, 3,5-dimethyl-
- Formula: C8H16O
- Molecular weight: 128.2120
- IUPAC Standard InChIKey: WIYNOPYNRFPWNB-UHFFFAOYSA-N
- CAS Registry Number: 5441-52-1
- Chemical structure:
View 3d structure (requires JavaScript / HTML 5) - Species with the same structure:
- Stereoisomers:
- Other names: 3,5-Dimethylcyclohexanol; 3,5-Dimethylcyclohexanol,c&t; 3,5-dimethylcyclohexan-1-ol

Condensed phase thermochemistry data

Data compiled by: Hussein Y. Afeefy, Joel F. Liebman, and Stephen E. Stein
Quantity | Value | Units | Method | Reference | Comment |
---|---|---|---|---|---|
ΔcH°liquid | -4990.7 | kJ/mol | Ccb | Zubova, 1901 | Corresponding ΔfHºliquid = -443.9 kJ/mol (simple calculation by NIST; no Washburn corrections) |

Phase change data

Data compiled by: Robert L. Brown and Stephen E. Stein
Quantity | Value | Units | Method | Reference | Comment |
---|---|---|---|---|---|
Tboil | 458.7 | K | N/A | Aldrich Chemical Company Inc., 1990 |

Normal alkane RI, non-polar column, temperature ramp

View large format table.

Column type Active phase I Reference Comment
CapillaryOV-1972.Guan, Zheng, et al., 199250. m/0.32 mm/0.52 μm, H2, 1. K/min; Tstart: 30. C
CapillaryOV-1974.Guan, Zheng, et al., 199250. m/0.32 mm/0.52 μm, H2, 2. K/min; Tstart: 35. C

Normal alkane RI, polar column, custom temperature program

View large format table.

Column type Active phase I Reference Comment
CapillaryBP-201809.Rodrigues, Caldera, et al., 200830. m/0.25 mm/0.25 μm, Helium; Program: 40 0C (1 min) 2 0C/min -> 100 0C (2 min) 1.7 0C/min -> 180 0C (1 min) 25 0C/min -> 220 0C (10 min)

References

Zubova, 1901
Zubova, P.,
Data about heat of combustion of compound cycle structure,
Zh. Fiz. Khim., 1901, 33, 708-722. [all data]
Aldrich Chemical Company Inc., 1990
Aldrich Chemical Company Inc.,
Catalog Handbook of Fine Chemicals, Aldrich Chemical Company, Inc., Milwaukee WI, 1990, 1. [all data]