4-Propoxybenzoic acid
- Formula: C10H12O3
- Molecular weight: 180.2005
- IUPAC Standard InChIKey: GDFUWFOCYZZGQU-UHFFFAOYSA-N
- CAS Registry Number: 5438-19-7
- Chemical structure:
View 3d structure (requires JavaScript / HTML 5) - Other names: 4-n-Propoxybenzoic acid; p-Propoxybenzoic acid; p-n-Propoxybenzoic acid; p-Propyloxybenzoic acid; Benzoic acid, p-propoxy-; Benzoic acid, 4-propoxy-; 4-n-propyloxybenzoic acid; Para -4- Propoxy Benzoic Acid

Phase change data

Data compiled by: James S. Chickos, William E. Acree, Jr., Joel F. Liebman, Students of Chem 202 (Introduction to the Literature of Chemistry), University of Missouri -- St. Louis
Entropy of fusion
ΔfusS (J/mol*K) | Temperature (K) | Reference |
---|---|---|
20.17 | 394.2 | Herbert, 1967 |
39.89 | 419.7 | |
5.88 | 426.7 |

References

Herbert, 1967
Herbert, A.J.,
Transition temperatures and transition energies of the p-n-alkoxy benzoic acids, from n-propyl to n-octadecyl,
Trans. Faraday Soc., 1967, 63, 555, https://doi.org/10.1039/tf9676300555
. [all data]