p-(2-Chloroethoxy)benzaldehyde
- Formula: C9H9ClO2
- Molecular weight: 184.620
- IUPAC Standard InChIKey: HBHHMVNKQWECIS-UHFFFAOYSA-N
- CAS Registry Number: 54373-15-8
- Chemical structure:
View 3d structure (requires JavaScript / HTML 5) - Permanent link for this species. Use this link for bookmarking this species for future reference.

Phase change data

Data compiled by: Robert L. Brown and Stephen E. Stein
Reduced pressure boiling point
Tboil (K) | Pressure (bar) | Reference |
---|---|---|
418. to 420. | 0.003 | Frinton Laboratories Inc., 1986 |

References

Frinton Laboratories Inc., 1986
Frinton Laboratories Inc.,
Catalog Number 11, Frinton Laboratories Inc., Vineland, NJ, 1986, 99. [all data]