Diphenylmethylene diacetate

Condensed phase thermochemistry data

Data compiled by: Hussein Y. Afeefy, Joel F. Liebman, and Stephen E. Stein

Quantity Value Units Method Reference Comment
Δfsolid-661.0 ± 3.6kJ/molCcbVerevkin, Peng, et al., 1996
Quantity Value Units Method Reference Comment
Δcsolid-8315.3 ± 3.6kJ/molCcbVerevkin, Peng, et al., 1996Corresponding Δfsolid = -661.0 kJ/mol (simple calculation by NIST; no Washburn corrections)

Gas phase thermochemistry data

Data compiled by: Hussein Y. Afeefy, Joel F. Liebman, and Stephen E. Stein

Quantity Value Units Method Reference Comment
Δfgas-128.4 ± 0.91kcal/molCcbVerevkin, Peng, et al., 1996

Phase change data

Data compiled as indicated in comments:
ALS - Hussein Y. Afeefy, Joel F. Liebman, and Stephen E. Stein
AC - William E. Acree, Jr., James S. Chickos

Quantity Value Units Method Reference Comment
Δsub29.54 ± 0.29kcal/molVVerevkin, Peng, et al., 1996ALS

Enthalpy of sublimation

ΔsubH (kcal/mol) Temperature (K) Method Reference Comment
29.18 ± 0.29368.GSVerevkin, Peng, et al., 1996Based on data from 348. - 388. K.; AC

References

Verevkin, Peng, et al., 1996
Verevkin, S.P.; Peng, W.-H.; Beckhaus, H.D.; Ruchardt, C., Thermochemical study of aliphatic and phenyl-substituted germinal diacetates, Struct. Chem., 1996, 7, 397-404. [all data]