4-Isopropylcyclohexanone
- Formula: C9H16O
- Molecular weight: 140.2227
- IUPAC Standard InChIKey: FPKISACHVIIMRA-UHFFFAOYSA-N
- CAS Registry Number: 5432-85-9
- Chemical structure:
View 3d structure (requires JavaScript / HTML 5) - Species with the same structure:
- Other names: Cyclohexanone, 4-(1-methylethyl)-; Cyclohexanone, 4-isopropyl-; 4-isopropylcyclohexan-1-one

Phase change data

Data compiled by: Robert L. Brown and Stephen E. Stein
Reduced pressure boiling point
Tboil (K) | Pressure (bar) | Reference |
---|---|---|
412.7 | 0.133 | Weast and Grasselli, 1989 |
367. to 369. | 0.023 | Frinton Laboratories Inc., 1986 |

Kovats' RI, non-polar column, isothermal

Column type | Active phase | Temperature (C) | I | Reference | Comment |
---|---|---|---|---|---|
Packed | Apiezon L | 130. | 1182. | Paris and Alexandre, 1972 | Chromosorb W AW |

Normal alkane RI, polar column, temperature ramp

Column type | Active phase | I | Reference | Comment |
---|---|---|---|---|
Capillary | TC-FFAP | 1571. | Kurose, Okamura, et al., 2007 | He, 3. K/min, 220. C @ 30. min; Column diameter: 0.25 mm; Phase thickness: 0.25 μm; Tstart: 60. C |

References

Weast and Grasselli, 1989
CRC Handbook of Data on Organic Compounds, 2nd Editon, Weast,R.C and Grasselli, J.G., ed(s)., CRC Press, Inc., Boca Raton, FL, 1989, 1. [all data]
Frinton Laboratories Inc., 1986
Frinton Laboratories Inc.,
Catalog Number 11, Frinton Laboratories Inc., Vineland, NJ, 1986, 99. [all data]
Paris and Alexandre, 1972
Paris, C.; Alexandre, P.,
Stereochemical Investigation of Cyclohexane and Terpene Compounds by Gas Chromatography,
J. Chromatogr. Sci., 1972, 10, 6, 402-411, https://doi.org/10.1093/chromsci/10.6.402
. [all data]
Kurose, Okamura, et al., 2007
Kurose, K.; Okamura, D.; Yatagai, M.,
Composition of the essential oils from the leaves of nine Pinus species and the cones of three of Pinus species,
Flavour Fragr. J., 2007, 22, 1, 10-20, https://doi.org/10.1002/ffj.1609
. [all data]