Isobutyl chloroformate
- Formula: C5H9ClO2
- Molecular weight: 136.577
- IUPAC Standard InChIKey: YOETUEMZNOLGDB-UHFFFAOYSA-N
- CAS Registry Number: 543-27-1
- Chemical structure:
View 3d structure (requires JavaScript / HTML 5) - Other names: Carbonochloridic acid, 2-methylpropyl ester; Chlorocarbonic acid isobutyl ester; Chloroformic acid isobutyl ester; Formic acid, chloro-, isobutyl ester; Isobutyl chlorocarbonate; 2-Methylpropyl carbonochloridate; 2-Methylpropyl chloroformate; Isobutyl chloridocarbonate; NSC 8429

Phase change data

Data compiled by: Robert L. Brown and Stephen E. Stein
Quantity | Value | Units | Method | Reference | Comment |
---|---|---|---|---|---|
Tboil | 402.0 | K | N/A | Weast and Grasselli, 1989 |

Van Den Dool and Kratz RI, non-polar column, custom temperature program

Column type | Active phase | I | Reference | Comment |
---|---|---|---|---|
Capillary | VF-5MS | 808. | Tretyakov, 2011 | 30. m/0.25 mm/0.25 μm, He; Program: Multi-step temperature program; T(initial)=60C; T(final)=270C |

References

Weast and Grasselli, 1989
CRC Handbook of Data on Organic Compounds, 2nd Editon, Weast,R.C and Grasselli, J.G., ed(s)., CRC Press, Inc., Boca Raton, FL, 1989, 1. [all data]
Tretyakov, 2011
Tretyakov, K.V.,
Retention Data. NIST Mass Spectrometry Data Center., NIST Mass Spectrometry Data Center, 2011. [all data]