Methane, oxybis[chloro-
- Formula: C2H4Cl2O
- Molecular weight: 114.959
- IUPAC Standard InChIKey: HRQGCQVOJVTVLU-UHFFFAOYSA-N
- CAS Registry Number: 542-88-1
- Chemical structure:
View 3d structure (requires JavaScript / HTML 5) - Species with the same structure:
- Other names: Ether, bis(chloromethyl); α,α'-Dichlorodimethyl ether; (Monochloromethyl) ether; s-Di(chloromethyl) ether; Bis(chloromethyl) ether; Chloromethyl ether; Dichlorodimethyl ether; Oxybis[chloromethane]; Chloro(chloromethoxy) methane; sym-Dichloro-dimethyl ether; BCME; Bis-CME; Dichlordimethylaether; 1,1'-Dichlorodimethyl ether; Dichlorodimethyl ether, symmetrical; sym-Dichloromethyl ether; Dimethyl-1,1'-dichloroether; Rcra waste number P016; UN 2249; Methane, 1,1'-oxybis[1-chloro-

Phase change data

Data compiled as indicated in comments:
BS - Robert L. Brown and Stephen E. Stein
TRC - Thermodynamics Research Center, NIST Boulder Laboratories, Chris Muzny director
Quantity | Value | Units | Method | Reference | Comment |
---|---|---|---|---|---|
Tboil | 377.2 | K | N/A | Weast and Grasselli, 1989 | BS |
Tboil | 378.2 | K | N/A | Laato, 1962 | Uncertainty assigned by TRC = 2. K; TRC |
Tboil | 378.7 | K | N/A | Lecat, 1947 | Uncertainty assigned by TRC = 0.6 K; TRC |

Normal alkane RI, non-polar column, temperature ramp

Column type | Active phase | I | Reference | Comment |
---|---|---|---|---|
Capillary | OV-101 | 699. | Zenkevich, 2005 | 25. m/0.20 mm/0.10 μm, N2/He, 6. K/min; Tstart: 50. C; Tend: 250. C |

References

Weast and Grasselli, 1989
CRC Handbook of Data on Organic Compounds, 2nd Editon, Weast,R.C and Grasselli, J.G., ed(s)., CRC Press, Inc., Boca Raton, FL, 1989, 1. [all data]
Laato, 1962
Laato, H.,
Chlorination of Monochlorodimethyl Ether with Sulfuryl Chloride,
Suomen Kemistilihti, 1962, 35B, 90. [all data]
Lecat, 1947
Lecat, M.,
Orthobaric Azeotropes of Sulfides,
Bull. Cl. Sci., Acad. R. Belg., 1947, 33, 160-82. [all data]
Zenkevich, 2005
Zenkevich, I.G.,
Experimentally measured retention indices., 2005. [all data]