2-Chloroethyl methyl sulfide
- Formula: C3H7ClS
- Molecular weight: 110.606
- IUPAC Standard InChIKey: MYFKLQFBFSHBPA-UHFFFAOYSA-N
- CAS Registry Number: 542-81-4
- Chemical structure:
View 3d structure (requires JavaScript / HTML 5) - Other names: β-Chloroethyl methyl sulfide; Ethane, 1-chloro-2-(methylthio)-; Hemisulfur mustard; Sulfide, 2-chloroethyl methyl; 1-Chloro-2-(methylthio)ethane; 2-Methylthioethyl chloride; 2-chloroethyl methyl sulphide

Phase change data

Data compiled as indicated in comments:
BS - Robert L. Brown and Stephen E. Stein
AC - William E. Acree, Jr., James S. Chickos
Reduced pressure boiling point
Tboil (K) | Pressure (bar) | Reference | Comment |
---|---|---|---|
328.7 | 0.040 | Aldrich Chemical Company Inc., 1990 | BS |
333.2 | 0.040 | Weast and Grasselli, 1989 | BS |
Enthalpy of vaporization
ΔvapH (kJ/mol) | Temperature (K) | Method | Reference | Comment |
---|---|---|---|---|
42.4 | 308. | A,GS | Stephenson and Malanowski, 1987 | Based on data from 293. to 333. K. See also Redemann, Chaikin, et al., 1948 and Dykyj, 1970.; AC |

References

Aldrich Chemical Company Inc., 1990
Aldrich Chemical Company Inc.,
Catalog Handbook of Fine Chemicals, Aldrich Chemical Company, Inc., Milwaukee WI, 1990, 1. [all data]
Weast and Grasselli, 1989
CRC Handbook of Data on Organic Compounds, 2nd Editon, Weast,R.C and Grasselli, J.G., ed(s)., CRC Press, Inc., Boca Raton, FL, 1989, 1. [all data]
Stephenson and Malanowski, 1987
Stephenson, Richard M.; Malanowski, Stanislaw,
Handbook of the Thermodynamics of Organic Compounds, 1987, https://doi.org/10.1007/978-94-009-3173-2
. [all data]
Redemann, Chaikin, et al., 1948
Redemann, C. Ernst; Chaikin, Saul W.; Fearing, Ralph B.,
The Volatility and Vapor Pressure of Eight 2-Chloroethyl Alkyl (or Cycloalkyl) Sulfides 1,
J. Am. Chem. Soc., 1948, 70, 2, 631-633, https://doi.org/10.1021/ja01182a059
. [all data]
Dykyj, 1970
Dykyj, J.,
Petrochemica, 1970, 10, 2, 51. [all data]