1-Propene, 1,3-dichloro-
- Formula: C3H4Cl2
- Molecular weight: 110.970
- IUPAC Standard InChIKey: UOORRWUZONOOLO-UHFFFAOYSA-N
- CAS Registry Number: 542-75-6
- Chemical structure:
View 3d structure (requires JavaScript / HTML 5) - Stereoisomers:
- Other names: Propene, 1,3-dichloro-; α,γ-Dichloropropylene; γ-Chloroallyl chloride; Telone; Telone C; 1,3-D; 1,3-Dichloro-1-propene; 1,3-Dichloro-2-propene; 1,3-Dichloropropene; 1,3-Dichloropropylene; 3-Chloropropenyl chloride; 1,3-Dichlorpropene; 1,3-Dichloropropene,c&t; 1,3-Dichloro-1-propene,c&t; Nemex; NCI-C03985; Telone II; 1,3-Dichloropropene-1; D-D92; D-D95; Dedisol C; Dorlone II; Telone 2000; 3-Chloroallyl chloride; NSC 6202; Telone II-B

Phase change data

Data compiled by: Robert L. Brown and Stephen E. Stein
Reduced pressure boiling point
Tboil (K) | Pressure (bar) | Reference |
---|---|---|
378.7 | 0.973 | Aldrich Chemical Company Inc., 1990 |

Henry's Law data

Data compiled by: Rolf Sander
Henry's Law constant (water solution)
kH(T) = k°H exp(d(ln(kH))/d(1/T) ((1/T) - 1/(298.15 K)))
k°H = Henry's law constant for solubility in water at 298.15 K (mol/(kg*bar))
d(ln(kH))/d(1/T) = Temperature dependence constant (K)
k°H (mol/(kg*bar)) | d(ln(kH))/d(1/T) (K) | Method | Reference |
---|---|---|---|
0.65 | 4200. | M | N/A |
0.51 | X | N/A | |
0.28 | 1500. | X | N/A |

References

Aldrich Chemical Company Inc., 1990
Aldrich Chemical Company Inc.,
Catalog Handbook of Fine Chemicals, Aldrich Chemical Company, Inc., Milwaukee WI, 1990, 1. [all data]