1,2,2,3-Tetrabromopropane
- Formula: C3H4Br4
- Molecular weight: 359.680
- IUPAC Standard InChIKey: SNLFZAHVOKOBOP-UHFFFAOYSA-N
- CAS Registry Number: 54268-02-9
- Chemical structure:
View 3d structure (requires JavaScript / HTML 5) - Permanent link for this species. Use this link for bookmarking this species for future reference.

Phase change data

Data compiled by: William E. Acree, Jr., James S. Chickos
Enthalpy of vaporization
ΔvapH (kJ/mol) | Temperature (K) | Method | Reference | Comment |
---|---|---|---|---|
57.7 | 433. | A | Stephenson and Malanowski, 1987 | Based on data from 418. to 580. K. See also Dykyj, 1970. |

References

Stephenson and Malanowski, 1987
Stephenson, Richard M.; Malanowski, Stanislaw,
Handbook of the Thermodynamics of Organic Compounds, 1987, https://doi.org/10.1007/978-94-009-3173-2
. [all data]
Dykyj, 1970
Dykyj, J.,
Petrochemica, 1970, 10, 2, 51. [all data]