1,2-dimethylcycloheptane
- Formula: C9H18
- Molecular weight: 126.2392
- IUPAC Standard InChIKey: CLYDEJQPKBFLJW-UHFFFAOYSA-N
- CAS Registry Number: 54267-77-5
- Chemical structure:
View 3d structure (requires JavaScript / HTML 5) - Stereoisomers:

Phase change data

Data compiled by: Thermodynamics Research Center, NIST Boulder Laboratories, Chris Muzny director
Quantity | Value | Units | Method | Reference | Comment |
---|---|---|---|---|---|
Tboil | 426. | K | N/A | Kipping and Perkin, 1891 | Uncertainty assigned by TRC = 4. K |

References

Kipping and Perkin, 1891
Kipping; Perkin,
J. Chem. Soc., 1891, 59, 214. [all data]