Ethanol, 2-chloro-, acetate
- Formula: C4H7ClO2
- Molecular weight: 122.550
- IUPAC Standard InChIKey: VIRWKAJWTKAIMA-UHFFFAOYSA-N
- CAS Registry Number: 542-58-5
- Chemical structure:
View 3d structure (requires JavaScript / HTML 5) - Other names: β-Chloroethyl acetate; 1-Acetoxy-2-chloroethane; 2-Acetoxy-1-chloroethane; 2-Acetoxyethyl chloride; 2-Chloroethyl acetate; CH3C(O)OCH2CH2Cl; Acetic acid β-chloroethyl ester; 2-Chloroethyl ethanoate; Acetoxyethyl chloride; 2-Chlorethylacetat; 2-Chloroethanol acetate; 2-Chloroethyl ester of acetic acid; Ethanol, 2-chloro-, 1-acetate; NSC 77374; Acetic acid, 2-chloroethyl ester; Chloroethyl acetate

Phase change data

Data compiled as indicated in comments:
BS - Robert L. Brown and Stephen E. Stein
ALS - Hussein Y. Afeefy, Joel F. Liebman, and Stephen E. Stein
Quantity | Value | Units | Method | Reference | Comment |
---|---|---|---|---|---|
Tboil | 418.2 | K | N/A | Weast and Grasselli, 1989 | BS |
Tboil | 418. | K | N/A | American Tokyo Kasei, 1988 | BS |
Quantity | Value | Units | Method | Reference | Comment |
ΔvapH° | 41.5 ± 0.2 | kJ/mol | V | Mathews, 1926 | ALS |

Kovats' RI, non-polar column, isothermal

Column type | Active phase | Temperature (C) | I | Reference | Comment |
---|---|---|---|---|---|
Capillary | SE-30 | 100. | 796. | Tarjan, Nyiredy, et al., 1989 | |
Capillary | SE-30 | 80. | 801. | Tarjan, Nyiredy, et al., 1989 | |
Capillary | SE-30 | 100. | 796. | Haken and Korhonen, 1986 | N2; Column length: 25. m; Column diameter: 0.33 mm |
Capillary | SE-30 | 60. | 817. | Haken and Korhonen, 1986 | N2; Column length: 25. m; Column diameter: 0.33 mm |
Capillary | SE-30 | 80. | 801. | Haken and Korhonen, 1986 | N2; Column length: 25. m; Column diameter: 0.33 mm |
Capillary | SE-30 | 140. | 816. | Korhonen, 1985 | N2; Column length: 25. m; Column diameter: 0.33 mm |
Capillary | SE-30 | 160. | 828. | Korhonen, 1985 | N2; Column length: 25. m; Column diameter: 0.33 mm |
Capillary | SE-30 | 180. | 846. | Korhonen, 1985 | N2; Column length: 25. m; Column diameter: 0.33 mm |
Capillary | OV-101 | 80. | 825. | Komárek, Hornová, et al., 1982 | N2; Column length: 15. m; Column diameter: 0.22 mm |

Kovats' RI, polar column, isothermal

Column type | Active phase | Temperature (C) | I | Reference | Comment |
---|---|---|---|---|---|
Capillary | OV-351 | 100. | 1297. | Haken and Korhonen, 1986 | N2; Column length: 25. m; Column diameter: 0.32 mm |
Capillary | OV-351 | 120. | 1299. | Haken and Korhonen, 1986 | N2; Column length: 25. m; Column diameter: 0.32 mm |
Capillary | OV-351 | 140. | 1354. | Haken and Korhonen, 1986 | N2; Column length: 25. m; Column diameter: 0.32 mm |
Capillary | OV-351 | 60. | 1315. | Haken and Korhonen, 1986 | N2; Column length: 25. m; Column diameter: 0.32 mm |
Capillary | OV-351 | 80. | 1319. | Haken and Korhonen, 1986 | N2; Column length: 25. m; Column diameter: 0.32 mm |
Capillary | OV-351 | 120. | 1313. | Korhonen, 1985 | N2; Column length: 25. m; Column diameter: 0.32 mm |
Capillary | OV-351 | 140. | 1365. | Korhonen, 1985 | N2; Column length: 25. m; Column diameter: 0.32 mm |
Capillary | OV-351 | 160. | 1331. | Korhonen, 1985 | N2; Column length: 25. m; Column diameter: 0.32 mm |

Van Den Dool and Kratz RI, non-polar column, temperature ramp

Column type | Active phase | I | Reference | Comment |
---|---|---|---|---|
Capillary | DB-5 | 832. | Dallüge, van Stee, et al., 2002 | 30. m/0.25 mm/1. μm, He, 2.5 K/min; Tstart: 50. C; Tend: 200. C |
Capillary | SE-30 | 828. | Korhonen, 1985 | N2, 6. K/min; Column length: 25. m; Column diameter: 0.33 mm; Tstart: 100. C; Tend: 320. C |

Van Den Dool and Kratz RI, non-polar column, custom temperature program

Column type | Active phase | I | Reference | Comment |
---|---|---|---|---|
Capillary | VF-5MS | 837.4 | Tret'yakov, 2008 | 30. m/0.25 mm/0.25 μm, He; Program: Multi-step temperature program; T(initial)=60C; T(final)=270C |

Van Den Dool and Kratz RI, polar column, temperature ramp

Column type | Active phase | I | Reference | Comment |
---|---|---|---|---|
Capillary | OV-351 | 1341. | Korhonen, 1985 | N2, 6. K/min; Column length: 25. m; Column diameter: 0.32 mm; Tstart: 100. C; Tend: 230. C |

Normal alkane RI, polar column, temperature ramp

Column type | Active phase | I | Reference | Comment |
---|---|---|---|---|
Packed | Carbowax 20M-TPA | 1318. | Szymanowski, Kusz, et al., 1990 | Chromosorb W AW DMCS, 100. C @ 1. min, 5. K/min; Column length: 1.6 m; Tend: 220. C |
Packed | Carbowax 20M-TPA | 1318. | Szymanowski, Kusz, et al., 1990, 2 | Chromosorb W AW DMCS, 100. C @ 1. min, 5. K/min; Column length: 1.6 m; Tend: 220. C |
Packed | Carbowax 20M-TPA | 1318. | Szymanowski, Kusz, et al., 1989 | Ar, Chromosorb W AW DMCS, 100. C @ 1. min, 5. K/min; Column length: 1.6 m; Tend: 220. C |

References

Weast and Grasselli, 1989
CRC Handbook of Data on Organic Compounds, 2nd Editon, Weast,R.C and Grasselli, J.G., ed(s)., CRC Press, Inc., Boca Raton, FL, 1989, 1. [all data]
American Tokyo Kasei, 1988
American Tokyo Kasei,
TCI American Organic Chemical 88/89 Catalog, American Tokyo Kasei, Portland, OR, 1988, 1610. [all data]
Mathews, 1926
Mathews, J.H.,
The accurate measurement of heats of vaporization of liquids,
J. Am. Chem. Soc., 1926, 48, 562-576. [all data]
Tarjan, Nyiredy, et al., 1989
Tarjan, G.; Nyiredy, Sz.; Gyor, M.; Lombosi, E.R.; Lombosi, T.S.; Budahegyi, M.V.; Meszaros, S.Y.; Takacs, J.M.,
Review. Thirtieth Anniversary of the Retention Index According to Kovats in Gas-Liquid Chromatography,
J. Chromatogr., 1989, 472, 1-92, https://doi.org/10.1016/S0021-9673(00)94099-8
. [all data]
Haken and Korhonen, 1986
Haken, J.K.; Korhonen, I.O.O.,
Gas chromatography of homologous esters. XXXII. Capillary chromatography of C1-C18 monochlorinated n-alkyl acetates,
J. Chromatogr., 1986, 356, 79-94, https://doi.org/10.1016/S0021-9673(00)91468-7
. [all data]
Korhonen, 1985
Korhonen, I.O.O.,
Gas-liquid chromatographic analyses. XLIII. Retention increments for 2-chloro-, 2,2-dichloro- and 2,2,2-trichloroethyl esters of aliphatic C2-C20 n-alkanoic acids on SE-30 and OV-351 capillary columns,
J. Chromatogr., 1985, 329, 43-56, https://doi.org/10.1016/S0021-9673(01)81894-X
. [all data]
Komárek, Hornová, et al., 1982
Komárek, K.; Hornová, L.; Churácek, J.,
Glass capillary gas chromatography of homologous series of esters. II. Separation of homologous series of halogenoethyl esters of aliphatic monocarboxylic acids on OV-101,
J. Chromatogr., 1982, 252, 293-296, https://doi.org/10.1016/S0021-9673(01)88420-X
. [all data]
Dallüge, van Stee, et al., 2002
Dallüge, J.; van Stee, L.L.P.; Xu, X.; Williams, J.; Beens, J.; Vreuls, R.J.J.; Brinkman, U.A.Th.,
Unravelling the composition of very complex samples by comprehensive gas chromatography coupled to time-of-flight mass spectrometry. Cigarette smoke,
J. Chromatogr. A, 2002, 974, 1-2, 169-184, https://doi.org/10.1016/S0021-9673(02)01384-5
. [all data]
Tret'yakov, 2008
Tret'yakov, K.V.,
Retention Data. NIST Mass Spectrometry Data Center., NIST Mass Spectrometry Data Center, 2008. [all data]
Szymanowski, Kusz, et al., 1990
Szymanowski, J.; Kusz, P.; Dziwinski, E.,
Degradation and analysis of commercial polyoxyethylene glycol mono(4-alkylphenyl) ethers,
J. Chromatogr., 1990, 511, 325-332, https://doi.org/10.1016/S0021-9673(01)93295-9
. [all data]
Szymanowski, Kusz, et al., 1990, 2
Szymanowski, J.; Kusz, P.; Dziwinski, E.; Latocha, Cz.,
Degradation and analysis of oligooxyethylene glycol mono(4-tert.-octylphenyl) ethers in the presence of acetyl chloride,
J. Chromatogr., 1990, 502, 407-415, https://doi.org/10.1016/S0021-9673(01)89606-0
. [all data]
Szymanowski, Kusz, et al., 1989
Szymanowski, J.; Kusz, P.; Dziwinski, E.; Szewczyk, H.; Pyzalski, K.,
Degradation and Analysis of Polyoxyethylene Monoalkyl Ethers in the Presence of Acetyl Chloride and Ferric Chloride,
J. Chromatogr., 1989, 469, 197-208, https://doi.org/10.1016/S0021-9673(01)96455-6
. [all data]