Isobutyl nitrite
- Formula: C4H9NO2
- Molecular weight: 103.1198
- IUPAC Standard InChIKey: APNSGVMLAYLYCT-UHFFFAOYSA-N
- CAS Registry Number: 542-56-3
- Chemical structure:

Gas phase thermochemistry data

Data compiled by: Hussein Y. Afeefy, Joel F. Liebman, and Stephen E. Stein
Quantity | Value | Units | Method | Reference | Comment |
---|---|---|---|---|---|
ΔfH°gas | -151. ± 4.2 | kJ/mol | Ccb | Batt, Christie, et al., 1974 |

Condensed phase thermochemistry data

Data compiled by: Hussein Y. Afeefy, Joel F. Liebman, and Stephen E. Stein
Quantity | Value | Units | Method | Reference | Comment |
---|---|---|---|---|---|
ΔfH°liquid | -186. | kJ/mol | Ccb | Batt, Christie, et al., 1974 | |
Quantity | Value | Units | Method | Reference | Comment |
ΔcH°liquid | -2675. ± 0.8 | kJ/mol | Ccb | Batt, Christie, et al., 1974 |

Phase change data

Data compiled as indicated in comments:
BS - Robert L. Brown and Stephen E. Stein
TRC - Thermodynamics Research Center, NIST Boulder Laboratories, Chris Muzny director
ALS - Hussein Y. Afeefy, Joel F. Liebman, and Stephen E. Stein
Quantity | Value | Units | Method | Reference | Comment |
---|---|---|---|---|---|
Tboil | 340.2 | K | N/A | Weast and Grasselli, 1989 | BS |
Tboil | 339. to 341. | K | N/A | Frinton Laboratories Inc., 1986 | BS |
Tboil | 340.3 | K | N/A | Lecat, 1947 | Uncertainty assigned by TRC = 0.5 K; TRC |
Tboil | 340.65 | K | N/A | Perkin, 1889 | Uncertainty assigned by TRC = 2. K; TRC |
Quantity | Value | Units | Method | Reference | Comment |
ΔvapH° | 35. | kJ/mol | E | Batt, Christie, et al., 1974 | ALS |

Normal alkane RI, non-polar column, temperature ramp

Column type | Active phase | I | Reference | Comment |
---|---|---|---|---|
Capillary | OV-101 | 544. | Zenkevich, 2005 | 25. m/0.20 mm/0.10 μm, N2/He, 6. K/min; Tstart: 50. C; Tend: 250. C |

Normal alkane RI, non-polar column, custom temperature program

Column type | Active phase | I | Reference | Comment |
---|---|---|---|---|
Capillary | SPB-1 | 576. | Flanagan, Streete, et al., 1997 | 60. m/0.53 mm/5. μm, He; Program: 40C(6min) => 5C/min => 80C => 10C/min => 200C |
Capillary | SPB-1 | 576. | Strete, Ruprah, et al., 1992 | 60. m/0.53 mm/5.0 μm, Helium; Program: 40 0C (6 min) 5 0C/min -> 80 0C 10 0C/min -> 200 0C |

Normal alkane RI, polar column, custom temperature program

Column type | Active phase | I | Reference | Comment |
---|---|---|---|---|
Packed | Carbowax 6M | 725. | Zenkevich and Malamakhov, 1984 | Nitrogen, Chromaton N AW (0.25-0.315 mm); Column length: 2. m; Program: not specified |

References

Batt, Christie, et al., 1974
Batt, L.; Christie, K.; Milne, R.T.; Summers, A.J.,
Heats of formation of C1-C4 alkyl nitrites (RONO) and their RO-NO bond dissociation energies,
Int. J. Chem. Kinet., 1974, 6, 877-886. [all data]
Weast and Grasselli, 1989
CRC Handbook of Data on Organic Compounds, 2nd Editon, Weast,R.C and Grasselli, J.G., ed(s)., CRC Press, Inc., Boca Raton, FL, 1989, 1. [all data]
Frinton Laboratories Inc., 1986
Frinton Laboratories Inc.,
Catalog Number 11, Frinton Laboratories Inc., Vineland, NJ, 1986, 99. [all data]
Lecat, 1947
Lecat, M.,
Orthobaric Azeotropes of Sulfides,
Bull. Cl. Sci., Acad. R. Belg., 1947, 33, 160-82. [all data]
Perkin, 1889
Perkin, W.H.,
The Magneto Rotatory Power of Nitrogne Compounds. also of Hydrochloric Hydrobromic and Hydroioidic Acids and of some of the Salts of Ammonia and the Compound Ammonias,
J. Chem. Soc., 1889, 55, 680. [all data]
Zenkevich, 2005
Zenkevich, I.G.,
Experimentally measured retention indices., 2005. [all data]
Flanagan, Streete, et al., 1997
Flanagan, R.J.; Streete, P.J.; Ramsey, J.D.,
Volatile Substance Abuse, UNODC Technical Series, No 5, United Nations, Office on Drugs and Crime, Vienna International Centre, PO Box 500, A-1400 Vienna, Austria, 1997, 56, retrieved from http://www.odccp.org/pdf/technicalseries1997-01-011.pdf. [all data]
Strete, Ruprah, et al., 1992
Strete, P.J.; Ruprah, M.; Ramsey, J.D.; Flanagan, R.J.,
Detection and identification of volatile substances by headspace capillary gas chromatography to aid the diagnosis of acute poisoning,
Analyst, 1992, 117, 7, 1111-1127, https://doi.org/10.1039/an9921701111
. [all data]
Zenkevich and Malamakhov, 1984
Zenkevich, I.G.; Malamakhov, A.S.,
Group Chromato Mass Spectrometric Identification of Alkylnitrites,
Zh. Anal. Khim. (Rus), 1984, 39, 10, 1864-1868. [all data]