Formic acid, 2-methylpropyl ester
- Formula: C5H10O2
- Molecular weight: 102.1317
- IUPAC Standard InChIKey: AVMSWPWPYJVYKY-UHFFFAOYSA-N
- CAS Registry Number: 542-55-2
- Chemical structure:
View 3d structure (requires JavaScript / HTML 5) - Other names: Formic acid, isobutyl ester; Isobutyl formate; Tetryl formate; 2-Methylpropyl formate; Isobutyl methanoate; Isobutylester kyseliny mravenci; UN 2393; 2-Methyl-1-propyl formate; NSC 6968

Condensed phase thermochemistry data

Data compiled by: Eugene S. Domalski and Elizabeth D. Hearing
Constant pressure heat capacity of liquid
Cp,liquid (J/mol*K) | Temperature (K) | Reference |
---|---|---|
214.2 | 290. | Kurnakov and Voskresenskaya, 1936 |

Phase change data

Data compiled as indicated in comments:
BS - Robert L. Brown and Stephen E. Stein
TRC - Thermodynamics Research Center, NIST Boulder Laboratories, Chris Muzny director
ALS - Hussein Y. Afeefy, Joel F. Liebman, and Stephen E. Stein
AC - William E. Acree, Jr., James S. Chickos
Quantity | Value | Units | Method | Reference | Comment |
---|---|---|---|---|---|
Tboil | 371. ± 1. | K | AVG | N/A | Average of 13 values; Individual data points |
Quantity | Value | Units | Method | Reference | Comment |
Tfus | 177.9 | K | N/A | Timmermans, 1922 | Uncertainty assigned by TRC = 0.4 K; TRC |
Quantity | Value | Units | Method | Reference | Comment |
Tc | 551.4 | K | N/A | Nadezhdin, 1887 | Uncertainty assigned by TRC = 4. K; TRC |
Quantity | Value | Units | Method | Reference | Comment |
Pc | 38.80 | bar | N/A | Nadezhdin, 1887 | Uncertainty assigned by TRC = 3.0398 bar; TRC |
Quantity | Value | Units | Method | Reference | Comment |
ρc | 2.819 | mol/l | N/A | Nadezhdin, 1887 | Uncertainty assigned by TRC = 0.05 mol/l; TRC |
Quantity | Value | Units | Method | Reference | Comment |
ΔvapH° | 33.6 ± 0.04 | kJ/mol | V | Mathews, 1926 | ALS |
Enthalpy of vaporization
ΔvapH (kJ/mol) | Temperature (K) | Method | Reference | Comment |
---|---|---|---|---|
36.6 | 386. | A | Stephenson and Malanowski, 1987 | Based on data from 371. to 507. K.; AC |
38.6 | 255. | A | Stephenson and Malanowski, 1987 | Based on data from 240. to 372. K. See also Stull, 1947.; AC |
Antoine Equation Parameters
log10(P) = A − (B / (T + C))
P = vapor pressure (bar)
T = temperature (K)
View plot Requires a JavaScript / HTML 5 canvas capable browser.
Temperature (K) | A | B | C | Reference | Comment |
---|---|---|---|---|---|
240.5 to 371.3 | 4.50966 | 1514.427 | -35.295 | Stull, 1947 | Coefficents calculated by NIST from author's data. |

Henry's Law data

Data compiled by: Rolf Sander
Henry's Law constant (water solution)
kH(T) = k°H exp(d(ln(kH))/d(1/T) ((1/T) - 1/(298.15 K)))
k°H = Henry's law constant for solubility in water at 298.15 K (mol/(kg*bar))
d(ln(kH))/d(1/T) = Temperature dependence constant (K)
k°H (mol/(kg*bar)) | d(ln(kH))/d(1/T) (K) | Method | Reference |
---|---|---|---|
1.7 | V | N/A |

Gas phase ion energetics data

Data compiled by: Henry M. Rosenstock, Keith Draxl, Bruce W. Steiner, and John T. Herron
Ionization energy determinations
IE (eV) | Method | Reference |
---|---|---|
10.46 ± 0.02 | PI | Watanabe, Nakayama, et al., 1962 |

Normal alkane RI, non-polar column, custom temperature program

Data compiled by: NIST Mass Spectrometry Data Center, William E. Wallace, director

Column type CapillaryCapillary
Active phase Methyl SiliconeSE-30
Column length (m)
Carrier gas
Substrate
Column diameter (mm)
Phase thickness (μm)
Program not specifiednot specified
I 670.673.
ReferenceDu and Feng, 2008Vinogradov, 2004
Comment MSDC-RI MSDC-RI

References

Kurnakov and Voskresenskaya, 1936
Kurnakov, N.S.; Voskresenskaya, N.K.,
Calorimetry of liquid binary systems, Izv. Akad. Nauk SSSR,
Otdel. Mat. i Estestv. Nauk. Ser. Khim, 1936, 1936, 439-461. [all data]
Timmermans, 1922
Timmermans, J.,
Investigation of the Freezing Point of Organic Substances VII,
Bull. Soc. Chim. Belg., 1922, 31, 389. [all data]
Nadezhdin, 1887
Nadezhdin, A.,
Rep. Phys., 1887, 23, 708. [all data]
Mathews, 1926
Mathews, J.H.,
The accurate measurement of heats of vaporization of liquids,
J. Am. Chem. Soc., 1926, 48, 562-576. [all data]
Stephenson and Malanowski, 1987
Stephenson, Richard M.; Malanowski, Stanislaw,
Handbook of the Thermodynamics of Organic Compounds, 1987, https://doi.org/10.1007/978-94-009-3173-2
. [all data]
Stull, 1947
Stull, Daniel R.,
Vapor Pressure of Pure Substances. Organic and Inorganic Compounds,
Ind. Eng. Chem., 1947, 39, 4, 517-540, https://doi.org/10.1021/ie50448a022
. [all data]