Carbonic acid, dibutyl ester
- Formula: C9H18O3
- Molecular weight: 174.2374
- IUPAC Standard InChIKey: QLVWOKQMDLQXNN-UHFFFAOYSA-N
- CAS Registry Number: 542-52-9
- Chemical structure:

Phase change data

Data compiled as indicated in comments:
TRC - Thermodynamics Research Center, NIST Boulder Laboratories, Chris Muzny director
AC - William E. Acree, Jr., James S. Chickos
Quantity | Value | Units | Method | Reference | Comment |
---|---|---|---|---|---|
Tboil | 480.6 | K | N/A | Wright, 1961 | Uncertainty assigned by TRC = 0.6 K; TRC |
Tboil | 481. | K | N/A | Wright, 1960 | Uncertainty assigned by TRC = 0.4 K; TRC |
Quantity | Value | Units | Method | Reference | Comment |
ΔvapH° | 62.9 ± 0.4 | kJ/mol | GS | Kozlova, Emel'yanenko, et al., 2008 | Based on data from 287. to 329. K.; AC |

References

Wright, 1961
Wright, F.J.,
Influence of temperature on viscosity of nonassociated liquids,
J. Chem. Eng. Data, 1961, 6, 454. [all data]
Wright, 1960
Wright, F.J.,
Latent Heat of Vaporization and Composition,
Recl. Trav. Chim. Pays-Bas, 1960, 79, 784-9. [all data]
Kozlova, Emel'yanenko, et al., 2008
Kozlova, Svetlana A.; Emel'yanenko, Vladimir N.; Georgieva, Miglena; Verevkin, Sergey P.; Chernyak, Yury; Schäffner, Benjamin; Börner, Armin,
Vapour pressure and enthalpy of vaporization of aliphatic dialkyl carbonates,
The Journal of Chemical Thermodynamics, 2008, 40, 7, 1136-1140, https://doi.org/10.1016/j.jct.2008.02.012
. [all data]