Sodium hydroxide
- Formula: H2Na2O2
- Molecular weight: 79.9942
- IUPAC Standard InChIKey: HEMHJVSKTPXQMS-UHFFFAOYSA-M
- CAS Registry Number: 54251-09-1
- Chemical structure:
View 3d structure (requires JavaScript / HTML 5) - Species with the same structure:

Gas phase thermochemistry data

Quantity | Value | Units | Method | Reference | Comment |
---|---|---|---|---|---|
ΔfH°gas | -607.52 | kJ/mol | Review | Chase, 1998 | Data last reviewed in December, 1970 |
Quantity | Value | Units | Method | Reference | Comment |
S°gas,1 bar | 307.39 | J/mol*K | Review | Chase, 1998 | Data last reviewed in December, 1970 |
Gas Phase Heat Capacity (Shomate Equation)
Cp° = A + B*t + C*t2 + D*t3 +
E/t2
H° − H°298.15= A*t + B*t2/2 +
C*t3/3 + D*t4/4 − E/t + F − H
S° = A*ln(t) + B*t + C*t2/2 + D*t3/3 −
E/(2*t2) + G
Cp = heat capacity (J/mol*K)
H° = standard enthalpy (kJ/mol)
S° = standard entropy (J/mol*K)
t = temperature (K) / 1000.
View plot Requires a JavaScript / HTML 5 canvas capable browser.
Temperature (K) | 298. to 1200. | 1200. to 6000. |
---|---|---|
A | 49.84441 | 112.9697 |
B | 126.8911 | 10.10486 |
C | -93.43792 | -1.897127 |
D | 27.11897 | 0.124278 |
E | -0.073674 | -12.11703 |
F | -627.4954 | -667.9338 |
G | 333.3782 | 407.4655 |
H | -607.5168 | -607.5168 |
Reference | Chase, 1998 | Chase, 1998 |
Comment | Data last reviewed in December, 1970 | Data last reviewed in December, 1970 |

References

Chase, 1998
Chase, M.W., Jr.,
NIST-JANAF Themochemical Tables, Fourth Edition,
J. Phys. Chem. Ref. Data, Monograph 9, 1998, 1-1951. [all data]