1H-1,2,3,4-Tetrazol-5-amine, 1-methyl-
- Formula: C2H5N5
- Molecular weight: 99.0946
- IUPAC Standard InChIKey: GTKOKCQMHAGFSM-UHFFFAOYSA-N
- CAS Registry Number: 5422-44-6
- Chemical structure:
View 3d structure (requires JavaScript / HTML 5) - Other names: 1-Methyl-5-aminotetrazole; 1H-Tetrazol-5-amine, 1-methyl-; 5-Amino-1-methyl-1H-tetrazole

Gas phase thermochemistry data

Data compiled as indicated in comments:
ALS - Hussein Y. Afeefy, Joel F. Liebman, and Stephen E. Stein
DRB - Donald R. Burgess, Jr.
Quantity | Value | Units | Method | Reference | Comment |
---|---|---|---|---|---|
ΔfH°gas | 302.4 ± 2.8 | kJ/mol | Ccb | Kozyro, Simirskii, et al., 1990 | ALS |
ΔfH°gas | 313.2 | kJ/mol | N/A | Williams, McEwan, et al., 1957 | Value computed using ΔfHsolid° value of 193.0 kj/mol from Williams, McEwan, et al., 1957 and ΔsubH° value of 120.2 kj/mol from Kozyro, Simirskii, et al., 1990.; DRB |

Condensed phase thermochemistry data

Data compiled by: Hussein Y. Afeefy, Joel F. Liebman, and Stephen E. Stein
Quantity | Value | Units | Method | Reference | Comment |
---|---|---|---|---|---|
ΔfH°solid | 182.2 ± 4.5 | kJ/mol | Ccb | Kozyro, Simirskii, et al., 1990 | |
ΔfH°solid | 193. | kJ/mol | Ccb | Williams, McEwan, et al., 1957 | |
Quantity | Value | Units | Method | Reference | Comment |
ΔcH°solid | -1683.8 ± 1.1 | kJ/mol | Ccb | Kozyro, Simirskii, et al., 1990 | |
ΔcH°solid | -1695.2 ± 0.46 | kJ/mol | Ccb | Williams, McEwan, et al., 1957 |

Phase change data

Data compiled as indicated in comments:
TRC - Thermodynamics Research Center, NIST Boulder Laboratories, Chris Muzny director
ALS - Hussein Y. Afeefy, Joel F. Liebman, and Stephen E. Stein
DRB - Donald R. Burgess, Jr.
AC - William E. Acree, Jr., James S. Chickos
Quantity | Value | Units | Method | Reference | Comment |
---|---|---|---|---|---|
Ttriple | 504. | K | N/A | Vorob'eva, 1990 | Uncertainty assigned by TRC = 1. K; TRC |
Quantity | Value | Units | Method | Reference | Comment |
ΔsubH° | 120.2 ± 1.7 | kJ/mol | V | Kozyro, Simirskii, et al., 1990 | ALS |
ΔsubH° | 120.2 | kJ/mol | N/A | Kozyro, Simirskii, et al., 1990 | DRB |
Enthalpy of sublimation
ΔsubH (kJ/mol) | Temperature (K) | Method | Reference | Comment |
---|---|---|---|---|
116.4 ± 1.7 | 379. to 438. | ME | Kozyro, Simirskii, et al., 1990, 2 | AC |

Reaction thermochemistry data

Data compiled by: Hussein Y. Afeefy, Joel F. Liebman, and Stephen E. Stein
Individual Reactions
= C2H5N5
By formula: C2H5N5 = C2H5N5
Quantity | Value | Units | Method | Reference | Comment |
---|---|---|---|---|---|
ΔrH° | 8.62 | kJ/mol | Kin | Henry, Finnegan, et al., 1955 | liquid phase |

References

Kozyro, Simirskii, et al., 1990
Kozyro, A.A.; Simirskii, V.V.; Krasulin, A.P.; Sevruk, V.M.; Kabo, G.Ya.; Frenkel, M.L.; Gaponik, P.N.; Grigor'ev, Yu.V.,
Thermodynamic properties of tetrazole derivatives in different aggregation states,
Russ. J. Phys. Chem. (Engl. Transl.), 1990, 64, 348-350. [all data]
Williams, McEwan, et al., 1957
Williams, M.M.; McEwan, W.S.; Henry, R.A.,
The heats of combustion of substituted triazoles, tetrazoles and related high nitrogen compounds,
J. Phys. Chem., 1957, 61, 261-267. [all data]
Vorob'eva, 1990
Vorob'eva, V.P.,
Enthalpies of phase transitions of tetrazole derivatives
in Vses. Konf. Term. Org. Soedin. 6th, Minsk, p 31, 1990. [all data]
Kozyro, Simirskii, et al., 1990, 2
Kozyro, A.A.; Simirskii, V.V.; Krasulin, A.P.; Sevruk, V.M.; Kabo, G.Y.; Frenkel, M.L.; Gaponik, P.N.; Grigor'ev, Y.V.,
Russ. J. Phys. Chem., 1990, 64, 348. [all data]
Henry, Finnegan, et al., 1955
Henry, R.A.; Finnegan, W.G.; Lieber, E.,
Kinetics of the isomerization of substituted 5-aminotetrazoles,
J. Am. Chem. Soc., 1955, 77, 2264-2270. [all data]