N-(2-Hydroxyethyl)lactamide
- Formula: C5H11NO3
- Molecular weight: 133.1457
- IUPAC Standard InChIKey: RZCHTMXTKQHYDT-UHFFFAOYSA-N
- CAS Registry Number: 5422-34-4
- Chemical structure:
View 3d structure (requires JavaScript / HTML 5) - Other names: Propanamide, 2-hydroxy-N-(2-hydroxyethyl)-; Lactamide, N-(2-hydroxyethyl)-; N-(β-Hydroxyethyl)-2-hydroxypropionamide; N-(β-Hydroxyethyl)lactamide; N-Hydroxyaethyllactamid; 2-Hydroxy-N-(2-hydroxyethyl)propanamide; Incromectant LMEA; Lactamide MEA; Lactic acid monoethanolamide; Lipamide LMEA; Mackamide LME; Monoethanolamine lactic acid amide; Parapel LAM-100; Schercomid LME-100; NSC 11062

Phase change data

Data compiled by: Robert L. Brown and Stephen E. Stein
Reduced pressure boiling point
Tboil (K) | Pressure (bar) | Reference |
---|---|---|
451. to 456. | 0.0001 | Frinton Laboratories Inc., 1986 |

References

Frinton Laboratories Inc., 1986
Frinton Laboratories Inc.,
Catalog Number 11, Frinton Laboratories Inc., Vineland, NJ, 1986, 99. [all data]