Cyclohexane, chloro-
- Formula: C6H11Cl
- Molecular weight: 118.605
- IUPAC Standard InChIKey: UNFUYWDGSFDHCW-UHFFFAOYSA-N
- CAS Registry Number: 542-18-7
- Chemical structure:
View 3d structure (requires JavaScript / HTML 5) - Other names: Chlorocyclohexane; Cyclohexyl chloride; Monochlorocyclohexane

Gas phase thermochemistry data

Data compiled by: Hussein Y. Afeefy, Joel F. Liebman, and Stephen E. Stein
Quantity | Value | Units | Method | Reference | Comment |
---|---|---|---|---|---|
ΔfH°gas | -166.5 ± 1.9 | kJ/mol | Ccb | An and Guo, 1995 | Author was aware that data differs from previously reported values; HCl(1:600 H2O) |
ΔfH°gas | -163.98 ± 0.62 | kJ/mol | Cm | Diky, Kabo, et al., 1994 | |
ΔfH°gas | -164. ± 3. | kJ/mol | Cm | Kirkbride, 1956 | Heat of formation derived by Cox and Pilcher, 1970 |

Reaction thermochemistry data

Data compiled by: Hussein Y. Afeefy, Joel F. Liebman, and Stephen E. Stein
Individual Reactions
By formula: C6H11Cl + HCl = C6H12 + Cl2
Quantity | Value | Units | Method | Reference | Comment |
---|---|---|---|---|---|
ΔrH° | -143.1 | kJ/mol | Cm | Kirkbride, 1956 | liquid phase |

Kovats' RI, non-polar column, isothermal

Column type | Active phase | Temperature (C) | I | Reference | Comment |
---|---|---|---|---|---|
Packed | Apolane | 150. | 918. | Evans and Haken, 1987 | He, Chromosorb G AW DCMS; Column length: 3.7 m |
Packed | Apolane | 150. | 918. | Haken and Vernon, 1986 | Chromosorb G AW DCMS; Column length: 3.7 m |
Packed | SE-30 | 150. | 905. | Tiess, 1984 | Ar, Gas Chrom Q (80-100 mesh); Column length: 3. m |
Packed | Apiezon L | 130. | 922. | Wehrli and Kováts, 1959 | Celite; Column length: 2.25 m |

Kovats' RI, polar column, isothermal

Column type | Active phase | Temperature (C) | I | Reference | Comment |
---|---|---|---|---|---|
Packed | Carbowax 20M | 150. | 1173. | Haken and Vernon, 1986 | Chromosorb G AW DCMS; Column length: 3.7 m; Column diameter: 6.4 mm |

Van Den Dool and Kratz RI, non-polar column, temperature ramp

Column type | Active phase | I | Reference | Comment |
---|---|---|---|---|
Capillary | Petrocol DH | 867. | White, Hackett, et al., 1992 | 100. m/0.25 mm/0.5 μm, He, 1. K/min; Tstart: 30. C; Tend: 220. C |
Packed | SE-30 | 888. | Buchman, Cao, et al., 1984 | He, Chromosorb AW, 40. C @ 10. min, 10. K/min, 210. C @ 30. min; Column length: 3.05 m |
Packed | SE-30 | 888. | Buchman, Cao, et al., 1984 | He, Chromosorb AW, 40. C @ 10. min, 10. K/min, 210. C @ 30. min; Column length: 3.05 m |

Van Den Dool and Kratz RI, polar column, temperature ramp

Column type | Active phase | I | Reference | Comment |
---|---|---|---|---|
Packed | Carbowax 20M | 1163. | Buchman, Cao, et al., 1984 | He, Supelcoport, 40. C @ 10. min, 10. K/min, 210. C @ 30. min; Column length: 3.05 m |
Packed | Carbowax 20M | 1163. | Buchman, Cao, et al., 1984 | He, Supelcoport, 40. C @ 10. min, 10. K/min, 210. C @ 30. min; Column length: 3.05 m |

Normal alkane RI, non-polar column, temperature ramp

Column type | Active phase | I | Reference | Comment |
---|---|---|---|---|
Capillary | OV-101 | 867. | Zenkevich, Eliseenkov, et al., 2009 | 25. m/0.20 mm/0.25 μm, Nitrogen, 6. K/min; Tstart: 60. C; Tend: 240. C |
Capillary | OV-101 | 870. | Zenkevich, Eliseenkov, et al., 2009 | 25. m/0.20 mm/0.25 μm, Nitrogen, 6. K/min; Tstart: 60. C; Tend: 240. C |
Capillary | OV-101 | 870. | Zenkevich, Eliseenkov, et al., 2009 | 25. m/0.20 mm/0.25 μm, Nitrogen, 6. K/min; Tstart: 60. C; Tend: 240. C |
Capillary | OV-101 | 870. | Zenkevich, Eliseenkov, et al., 2009 | 25. m/0.20 mm/0.25 μm, Nitrogen, 6. K/min; Tstart: 60. C; Tend: 240. C |
Capillary | OV-101 | 871. | Zenkevich, Eliseenkov, et al., 2009 | 25. m/0.20 mm/0.25 μm, Nitrogen, 6. K/min; Tstart: 60. C; Tend: 240. C |

Normal alkane RI, non-polar column, custom temperature program

Column type | Active phase | I | Reference | Comment |
---|---|---|---|---|
Capillary | Polydimethyl siloxanes | 874. | Zenkevich, Eliseenkov, et al., 2006 | Program: not specified |
Capillary | Methyl Silicone | 922. | N/A | Program: not specified |
Capillary | Methyl Silicone | 874. | Zenkevich, 1998 | Program: not specified |
Capillary | Polydimethyl siloxanes | 874. | Zenkevich and Chupalov, 1996 | Program: not specified |

Normal alkane RI, polar column, custom temperature program

Column type | Active phase | I | Reference | Comment |
---|---|---|---|---|
Capillary | Carbowax 400, Carbowax 20M, Carbowax 1540, Carbowax 4000, Superox 06, PEG 20M, etc. | 1163. | Waggott and Davies, 1984 | Hydrogen; Column length: 50. m; Column diameter: 0.32 mm; Program: not specified |

Condensed phase thermochemistry data

Data compiled by: Hussein Y. Afeefy, Joel F. Liebman, and Stephen E. Stein
Quantity | Value | Units | Method | Reference | Comment |
---|---|---|---|---|---|
ΔfH°liquid | -209.1 ± 1.9 | kJ/mol | Ccb | An and Guo, 1995 | Author was aware that data differs from previously reported values; HCl(1:600 H2O) |
ΔfH°liquid | -206.9 ± 2.1 | kJ/mol | Cm | Diky, Kabo, et al., 1994 | |
ΔfH°liquid | -207. | kJ/mol | Cm | Kirkbride, 1956 | |
Quantity | Value | Units | Method | Reference | Comment |
ΔcH°liquid | -3747.6 ± 1.9 | kJ/mol | Ccb | An and Guo, 1995 | Author was aware that data differs from previously reported values; HCl(1:600 H2O) |

Phase change data

Data compiled as indicated in comments:
BS - Robert L. Brown and Stephen E. Stein
TRC - Thermodynamics Research Center, NIST Boulder Laboratories, Chris Muzny director
ALS - Hussein Y. Afeefy, Joel F. Liebman, and Stephen E. Stein
AC - William E. Acree, Jr., James S. Chickos
CAL - James S. Chickos, William E. Acree, Jr., Joel F. Liebman, Students of Chem 202 (Introduction to the Literature of Chemistry), University of Missouri -- St. Louis
Quantity | Value | Units | Method | Reference | Comment |
---|---|---|---|---|---|
Tboil | 416. ± 1. | K | AVG | N/A | Average of 6 values; Individual data points |
Quantity | Value | Units | Method | Reference | Comment |
Tfus | 230.15 | K | N/A | Timmermans and Hennaut-Roland, 1955 | Uncertainty assigned by TRC = 0.3 K; TRC |
Tfus | 230.1 | K | N/A | Timmermans, 1952 | Uncertainty assigned by TRC = 0.3 K; TRC |
Tfus | 228.8 | K | N/A | Crowe and Smyth, 1951 | Crystal phase 1 phase; Uncertainty assigned by TRC = 0.3 K; TRC |
Tfus | 226. | K | N/A | White and Bishop, 1940 | Crystal phase 1 phase; Uncertainty assigned by TRC = 3. K; TRC |
Tfus | 230.00 | K | N/A | Van de Vloed, 1939 | Uncertainty assigned by TRC = 1.5 K; by cryoscopic; TRC |
Quantity | Value | Units | Method | Reference | Comment |
Ttriple | 229.34 | K | N/A | Diky, Kabo, et al., 1994, 2 | Crystal phase 1 phase; Uncertainty assigned by TRC = 0.01 K; TRC |
Quantity | Value | Units | Method | Reference | Comment |
ΔvapH° | 42. ± 2. | kJ/mol | AVG | N/A | Average of 6 values; Individual data points |
Enthalpy of vaporization
ΔvapH (kJ/mol) | Temperature (K) | Method | Reference | Comment |
---|---|---|---|---|
39.3 | 365. | A | Stephenson and Malanowski, 1987 | Based on data from 350. to 416. K. See also Andreevskii, Brazhnikov, et al., 1969.; AC |
Enthalpy of fusion
ΔfusH (kJ/mol) | Temperature (K) | Method | Reference | Comment |
---|---|---|---|---|
1.67 | 228.7 | DSC | Singh and Murthy, 2008 | AC |
2.04 | 229.3 | AC | Diky, Kabo, et al., 1994 | Based on data from 5. to 304. K.; AC |
Entropy of fusion
ΔfusS (J/mol*K) | Temperature (K) | Reference | Comment |
---|---|---|---|
0.42 | 120. | Kozyro, Kabo, et al., 1992 | CAL |
36.35 | 220.4 | ||
8.91 | 229.3 |

Gas phase ion energetics data

Data compiled as indicated in comments:
LLK - Sharon G. Lias, Rhoda D. Levin, and Sherif A. Kafafi
Ionization energy determinations
IE (eV) | Method | Reference | Comment |
---|---|---|---|
10.10 ± 0.01 | PI | Sergeev, Akopyan, et al., 1973 | LLK |
10.67 | PE | Sergeev, Akopyan, et al., 1973 | Vertical value; LLK |
Appearance energy determinations
Ion | AE (eV) | Other Products | Method | Reference | Comment |
---|---|---|---|---|---|
C4H6+ | 11.07 ± 0.03 | ? | PI | Sergeev, Akopyan, et al., 1973 | LLK |
C4H7+ | 11.52 ± 0.05 | ? | PI | Sergeev, Akopyan, et al., 1973 | LLK |
C4H8+ | 10.2 ± 0.01 | ? | PI | Sergeev, Akopyan, et al., 1973 | LLK |
C4H9+ | 10.56 ± 0.02 | ? | PI | Sergeev, Akopyan, et al., 1973 | LLK |
C5H7+ | 10.67 ± 0.05 | ? | PI | Sergeev, Akopyan, et al., 1973 | LLK |
C5H9+ | 11.01 ± 0.02 | ? | PI | Sergeev, Akopyan, et al., 1973 | LLK |
C6H9+ | 10.40 ± 0.02 | ? | PI | Sergeev, Akopyan, et al., 1973 | LLK |
C6H10+ | 10.10 ± 0.05 | ? | PI | Sergeev, Akopyan, et al., 1973 | LLK |
C6H11+ | 10.20 ± 0.05 | ? | PI | Sergeev, Akopyan, et al., 1973 | LLK |

References

An and Guo, 1995
An, X.-W.; Guo, D.-J.,
Formation enthalpies and non-bonding interactions of hexachlorocyclohexanes,
Thermochim. Acta, 1995, 253, 235-242. [all data]
Diky, Kabo, et al., 1994
Diky, V.V.; Kabo, G.J.; Kozyro, A.A.; Krasulin, A.P.; Sevruk, V.M.,
Thermodynamic properties of crystalline and liquid chlorocyclohexane and inversion of ring,
J. Chem. Thermodyn., 1994, 26, 1001-1013. [all data]
Kirkbride, 1956
Kirkbride, F.W.,
The heats of chlorination of some hydrocarbons and their chloro-derivatives,
J. Appl. Chem., 1956, 6, 11-21. [all data]
Cox and Pilcher, 1970
Cox, J.D.; Pilcher, G.,
Thermochemistry of Organic and Organometallic Compounds, Academic Press, New York, 1970, 1-636. [all data]
Evans and Haken, 1987
Evans, M.B.; Haken, J.K.,
Dispersion and selectivity indices of the halogenated derivatives of cyclohexane, benzene and anisole,
J. Chromatogr., 1987, 389, 240-244, https://doi.org/10.1016/S0021-9673(01)94428-0
. [all data]
Haken and Vernon, 1986
Haken, J.K.; Vernon, F.,
Gas chromatography of halogenated derivatives of cyclohexane, benzene and anisole,
J. Chromatogr., 1986, 361, 57-61, https://doi.org/10.1016/S0021-9673(01)86893-X
. [all data]
Tiess, 1984
Tiess, D.,
Gaschromatographische Retentionsindices von 125 leicht- bis mittelflüchtigen organischen Substanzen toxikologisch-analytischer Relevanz auf SE-30,
Wiss. Z. Wilhelm-Pieck-Univ. Rostock Math. Naturwiss. Reihe, 1984, 33, 6-9. [all data]
Wehrli and Kováts, 1959
Wehrli, A.; Kováts, E.,
Gas-chromatographische Charakterisierung ogranischer Verbindungen. Teil 3: Berechnung der Retentionsindices aliphatischer, alicyclischer und aromatischer Verbindungen,
Helv. Chim. Acta, 1959, 7, 7, 2709-2736, https://doi.org/10.1002/hlca.19590420745
. [all data]
White, Hackett, et al., 1992
White, C.M.; Hackett, J.; Anderson, R.R.; Kail, S.; Spock, P.S.,
Linear temperature programmed retention indices of gasoline range hydrocarbons and chlorinated hydrocarbons on cross-linked polydimethylsiloxane,
J. Hi. Res. Chromatogr., 1992, 15, 2, 105-120, https://doi.org/10.1002/jhrc.1240150211
. [all data]
Buchman, Cao, et al., 1984
Buchman, O.; Cao, G.-Y.; Peng, C.T.,
Structure assignment by retention index in gas-liquid radiochromatography of substituted cyclohexenes,
J. Chromatogr., 1984, 312, 75-90, https://doi.org/10.1016/S0021-9673(01)92765-7
. [all data]
Zenkevich, Eliseenkov, et al., 2009
Zenkevich, I.G.; Eliseenkov, E.V.; Kasatochkin, A.N.,
Chromatographic Identification of Cyclohexane Chlorination Products by an Additive Scheme for the Prediction of Retention Indices,
Chromatographia, 2009, 70, 5/6, 839-849, https://doi.org/10.1365/s10337-009-1213-x
. [all data]
Zenkevich, Eliseenkov, et al., 2006
Zenkevich, I.G.; Eliseenkov, E.V.; Kasatochkin, A.N.,
Application of Retention Indices in GC-MS Identification of Halogenated Organic Compounds,
Mass Spectromery (Rus.), 2006, 3, 2, 131-140. [all data]
Zenkevich, 1998
Zenkevich, I.G.,
Reciprocally Unambiguous Conformity Between GC Retention Indices and Boiling Points within Two- and Multidimensional Taxonomic Groups of Organic Compounds,
J. Hi. Res. Chromatogr., 1998, 21, 10, 565-568, https://doi.org/10.1002/(SICI)1521-4168(19981001)21:10<565::AID-JHRC565>3.0.CO;2-6
. [all data]
Zenkevich and Chupalov, 1996
Zenkevich, I.G.; Chupalov, A.A.,
New Possibilities of Chromato Mass Pectrometric Identification of Organic Compounds Using Increments of Gas Chromatographic Retention Indices of Molecular Structural Fragments,
Zh. Org. Khim. (Rus.), 1996, 32, 5, 656-666. [all data]
Waggott and Davies, 1984
Waggott, A.; Davies, I.W.,
Identification of organic pollutants using linear temperature programmed retention indices (LTPRIs) - Part II, 1984, retrieved from http://dwi.defra.gov.uk/research/completed-research/reports/dwi0383.pdf. [all data]