Benzene, 1-isocyanato-4-methoxy-
- Formula: C8H7NO2
- Molecular weight: 149.1467
- IUPAC Standard InChIKey: FMDGXCSMDZMDHZ-UHFFFAOYSA-N
- CAS Registry Number: 5416-93-3
- Chemical structure:
View 3d structure (requires JavaScript / HTML 5) - Other names: 4-Methoxyphenylisocyanate; p-Methoxyphenyl isocyanate; p-Methoxyphenyl 1socyanate; p-Anisyl isocyanate; Isocyanic acid, p-methoxyphenyl ester

Reaction thermochemistry data

Data compiled by: Hussein Y. Afeefy, Joel F. Liebman, and Stephen E. Stein
Individual Reactions
By formula: C10H14N2O2 = C2H7N + C8H7NO2
Quantity | Value | Units | Method | Reference | Comment |
---|---|---|---|---|---|
ΔrH° | 95.2 ± 0.9 | kJ/mol | Eqk | Chimishkyan, Svetlova, et al., 1984 | solid phase; Dissociation |
By formula: C15H16N2O3 = C7H9NO + C8H7NO2
Quantity | Value | Units | Method | Reference | Comment |
---|---|---|---|---|---|
ΔrH° | 73.3 ± 1.1 | kJ/mol | Eqk | Chimishkyan, Svetlova, et al., 1984 | solid phase; Dissociation |

References

Chimishkyan, Svetlova, et al., 1984
Chimishkyan, A.L.; Svetlova, L.P.; Leonova, T.V.; Gluyaev, N.D.,
Thermal decomposition of substituted ureas,
J. Gen. Chem. USSR, 1984, 54, 1317-1320. [all data]