1,4,4-trimethylcyclopentene
- Formula: C8H14
- Molecular weight: 110.1968
- IUPAC Standard InChIKey: CPUIRNMUUHFVRW-UHFFFAOYSA-N
- CAS Registry Number: 54168-64-8
- Chemical structure:
View 3d structure (requires JavaScript / HTML 5) - Permanent link for this species. Use this link for bookmarking this species for future reference.

Phase change data

Data compiled by: Thermodynamics Research Center, NIST Boulder Laboratories, Chris Muzny director
Quantity | Value | Units | Method | Reference | Comment |
---|---|---|---|---|---|
Tboil | 377. | K | N/A | Auterinen, 1954 | Uncertainty assigned by TRC = 3. K |
Tboil | 376.6 | K | N/A | Birch and Johnson, 1951 | Uncertainty assigned by TRC = 0.5 K |
Tboil | 376.63 | K | N/A | Slomp, 1951 | Uncertainty assigned by TRC = 0.3 K |
Tboil | 376.65 | K | N/A | Anonymous, 1945 | Uncertainty assigned by TRC = 0.3 K |
Quantity | Value | Units | Method | Reference | Comment |
Tfus | 156.06 | K | N/A | Slomp, 1951 | Uncertainty assigned by TRC = 0.3 K |
Tfus | 160.01 | K | N/A | Anonymous, 1945 | Uncertainty assigned by TRC = 0.3 K |

References

Auterinen, 1954
Auterinen, A.,
Suom. Kemistil. B, 1954, 27, 29. [all data]
Birch and Johnson, 1951
Birch; Johnson,
J. Chem. Soc., 1951, 1951, 1493. [all data]
Slomp, 1951
Slomp, G.,
, Ph.D. Thesis, Ohio State Univ., Columbus, OH, 1951. [all data]
Anonymous, 1945
Anonymous, R.,
, Sunbury Rep. No. 2777, Anglo-Iranian Oil Co. Ltd., 1945. [all data]