Di-t-butyldiazene N-oxide
- Formula: C8H18N2O
- Molecular weight: 158.2413
- IUPAC Standard InChIKey: YOGGJOULZPUAHF-KTKRTIGZSA-N
- CAS Registry Number: 54168-23-9
- Chemical structure:
View 3d structure (requires JavaScript / HTML 5) - Species with the same structure:

Phase change data

Data compiled by: Hussein Y. Afeefy, Joel F. Liebman, and Stephen E. Stein
Quantity | Value | Units | Method | Reference | Comment |
---|---|---|---|---|---|
ΔvapH° | 45.9 ± 0.1 | kJ/mol | C | Bystrom, 1981 |

References

Bystrom, 1981
Bystrom, K.,
Enthalpies of combustion, vaporization, and formation for di-n-propyldiazene N-oxide and di-t-butyldiazene N-oxide,
J. Chem. Thermodyn., 1981, 13, 139-145. [all data]