Benzamide, N-(2-piperidinylmethyl)-2,5-bis(2,2,2-trifluoroethoxy)-
- Formula: C17H20F6N2O3
- Molecular weight: 414.3427
- IUPAC Standard InChIKey: DJBNUMBKLMJRSA-UHFFFAOYSA-N
- CAS Registry Number: 54143-55-4
- Chemical structure:
View 3d structure (requires JavaScript / HTML 5) - Other names: Flecainide; N-(2-Piperidylmethyl)-2,5-bis(2,2,2-trifluoroethoxy)benzamide; N-(2-Piperidinylmethyl)-2,5-bis(2,2,2-trifluoroethoxy)benzamide

Van Den Dool and Kratz RI, non-polar column, temperature ramp

Column type | Active phase | I | Reference | Comment |
---|---|---|---|---|
Capillary | VF-5MS | 2271. | Tretyakov, 2014 | 30. m/0.25 mm/0.25 μm, He; Tstart: 60. C; Tend: 270. C |

References

Tretyakov, 2014
Tretyakov, K.V.,
Retention Data. NIST Mass Spectrometry Data Center., NIST Mass Spectrometry Data Center, 2014. [all data]