Butanamide
- Formula: C4H9NO
- Molecular weight: 87.1204
- IUPAC Standard InChIKey: DNSISZSEWVHGLH-UHFFFAOYSA-N
- CAS Registry Number: 541-35-5
- Chemical structure:
View 3d structure (requires JavaScript / HTML 5) - Other names: Butyramide; n-Butylamide; n-Butyramide; n-C3H7C(O)NH2

Gas phase thermochemistry data

Data compiled by: Hussein Y. Afeefy, Joel F. Liebman, and Stephen E. Stein
Quantity | Value | Units | Method | Reference | Comment |
---|---|---|---|---|---|
ΔfH°gas | -279.17 ± 0.88 | kJ/mol | Ccb | Barnes and Pilcher, 1975 | |
ΔfH°gas | -279.1 ± 1.8 | kJ/mol | Ccb | Lebedeva and Katin, 1973 | Reanalyzed by Pedley, Naylor, et al., 1986, Original value = -278.7 kJ/mol |

Condensed phase thermochemistry data

Data compiled by: Hussein Y. Afeefy, Joel F. Liebman, and Stephen E. Stein
Quantity | Value | Units | Method | Reference | Comment |
---|---|---|---|---|---|
ΔfH°solid | -365.53 ± 0.76 | kJ/mol | Ccb | Barnes and Pilcher, 1975 | |
ΔfH°solid | -364.0 ± 0.4 | kJ/mol | Ccb | Lebedeva and Katin, 1973 | |
Quantity | Value | Units | Method | Reference | Comment |
ΔcH°solid | -2494.7 ± 0.7 | kJ/mol | Ccb | Barnes and Pilcher, 1975 | |
ΔcH°solid | -2496.3 ± 0.4 | kJ/mol | Ccb | Lebedeva and Katin, 1973 |

Phase change data

Data compiled as indicated in comments:
BS - Robert L. Brown and Stephen E. Stein
TRC - Thermodynamics Research Center, NIST Boulder Laboratories, Chris Muzny director
AC - William E. Acree, Jr., James S. Chickos
ALS - Hussein Y. Afeefy, Joel F. Liebman, and Stephen E. Stein
Quantity | Value | Units | Method | Reference | Comment |
---|---|---|---|---|---|
Tboil | 489.2 | K | N/A | Weast and Grasselli, 1989 | BS |
Quantity | Value | Units | Method | Reference | Comment |
Tfus | 388.8 | K | N/A | Davies, Jones, et al., 1959 | Uncertainty assigned by TRC = 0.5 K; TRC |
Quantity | Value | Units | Method | Reference | Comment |
ΔsubH° | 82. ± 4.0 | kJ/mol | TE | Brunetti, Gatta, et al., 2000 | Based on data from 288. to 354. K.; AC |
ΔsubH° | 82. ± 4.0 | kJ/mol | TE | Brunetti, Gatta, et al., 2000 | Based on data from 298. to 347. K.; AC |
ΔsubH° | 86.36 ± 0.42 | kJ/mol | V | Barnes and Pilcher, 1975 | ALS |
ΔsubH° | 85.4 ± 1.7 | kJ/mol | ME | Lebedeva and Katin, 1973, 2 | Based on data from 292. to 304. K. See also Pedley and Rylance, 1977.; AC |
ΔsubH° | 85. ± 2. | kJ/mol | V | Lebedeva and Katin, 1973 | ALS |
Enthalpy of vaporization
ΔvapH (kJ/mol) | Temperature (K) | Method | Reference | Comment |
---|---|---|---|---|
64. | 412. | A | Stephenson and Malanowski, 1987 | Based on data from 397. to 504. K.; AC |
Enthalpy of sublimation
ΔsubH (kJ/mol) | Temperature (K) | Method | Reference | Comment |
---|---|---|---|---|
87. | 363. | N/A | Jones, 1960 | Based on data from 353. to 373. K.; AC |
86.4 ± 0.4 | 359. | GS | Davies, Jones, et al., 1959 | Based on data from 336. to 382. K.; AC |
87.0 ± 0.8 | 320. | ME | Davies, Jones, et al., 1959 | Based on data from 298. to 341. K.; AC |
Enthalpy of fusion
ΔfusH (kJ/mol) | Temperature (K) | Reference | Comment |
---|---|---|---|
19.2 | 387.3 | Abate, Badea, et al., 2008 | AC |
19.2 | 387.3 | Brunetti, Gatta, et al., 2000 | AC |

Gas phase ion energetics data

Data compiled by: Michael M. Meot-Ner (Mautner)
Gas basicity at 298K
Gas basicity (review) (kJ/mol) | Reference | Comment |
---|---|---|
847. ± 6. | Witt and Grutzmacher, 1997 | pyrrole; aniline. Data readjusted to Hunter and Lias, 1998 |
849. ± 5. | Witt and Grutzmacher, 1997 |

Van Den Dool and Kratz RI, polar column, custom temperature program

Column type | Active phase | I | Reference | Comment |
---|---|---|---|---|
Capillary | FFAP | 1901. | Yasuhara, 1987 | 50. m/0.25 mm/0.25 μm, He; Program: 20C (5min) => 2C/min => 70C => 4C/min => 210C |

References

Barnes and Pilcher, 1975
Barnes, D.S.; Pilcher, G.,
Enthalpies of combustion of ethanamide, propanamide, and butanamide,
J. Chem. Thermodyn., 1975, 7, 377-382. [all data]
Lebedeva and Katin, 1973
Lebedeva, N.D.; Katin, Yu.A.,
Enthalpies of formation of monocarboxylic acid amides,
J. Appl. Chem. USSR (Engl. Transl.), 1973, 46, 2131-21. [all data]
Pedley, Naylor, et al., 1986
Pedley, J.B.; Naylor, R.D.; Kirby, S.P.,
Thermochemical Data of Organic Compounds, Chapman and Hall, New York, 1986, 1-792. [all data]
Weast and Grasselli, 1989
CRC Handbook of Data on Organic Compounds, 2nd Editon, Weast,R.C and Grasselli, J.G., ed(s)., CRC Press, Inc., Boca Raton, FL, 1989, 1. [all data]
Davies, Jones, et al., 1959
Davies, M.; Jones, A.H.; Thomas, G.H.,
The lattice energies of the straight-chain primary amides,
Trans. Faraday Soc., 1959, 55, 1100. [all data]
Brunetti, Gatta, et al., 2000
Brunetti, Bruno; Gatta, Giuseppe Della; Piacente, Vincenzo,
Enthalpies and Entropies of Sublimation of Some Primary Alkylamides,
J. Chem. Eng. Data, 2000, 45, 2, 237-241, https://doi.org/10.1021/je9902701
. [all data]
Lebedeva and Katin, 1973, 2
Lebedeva, N.D.; Katin, Y.A.,
Russ. J. Appl. Chem., 1973, 46, 2131. [all data]
Pedley and Rylance, 1977
Pedley, J.B.; Rylance, J.,
, Computer Analysed Thermochemical Data: Organic and Organometallic Compounds, University of Sussex, Brighton, 1977. [all data]
Stephenson and Malanowski, 1987
Stephenson, Richard M.; Malanowski, Stanislaw,
Handbook of the Thermodynamics of Organic Compounds, 1987, https://doi.org/10.1007/978-94-009-3173-2
. [all data]
Jones, 1960
Jones, A.H.,
Sublimation Pressure Data for Organic Compounds.,
J. Chem. Eng. Data, 1960, 5, 2, 196-200, https://doi.org/10.1021/je60006a019
. [all data]
Abate, Badea, et al., 2008
Abate, Lorenzo; Badea, Elena; Blanco, Ignazio; Della Gatta, Giuseppe,
Heat Capacities and Enthalpies of Solid-Solid Transitions and Fusion of a Series of Eleven Primary Alkylamides by Differential Scanning Calorimetry,
J. Chem. Eng. Data, 2008, 53, 4, 959-965, https://doi.org/10.1021/je700662a
. [all data]
Witt and Grutzmacher, 1997
Witt, M.; Grutzmacher, H.F.,
Proton-bound dimers of aliphatic carboxamides: gas-phase basicity and dissociation energy,
Int. J. Mass Spectrom. Ion Processes, 1997, 165, 49. [all data]
Hunter and Lias, 1998
Hunter, E.P.; Lias, S.G.,
Evaluated Gas Phase Basicities and Proton Affinities of Molecules: An Update,
J. Phys. Chem. Ref. Data, 1998, 27, 3, 413-656, https://doi.org/10.1063/1.556018
. [all data]
Yasuhara, 1987
Yasuhara, A.,
Identification of Volatile Compounds in Poultry Manure by Gas Chromatography-Mass Spectrometry,
J. Chromatogr., 1987, 387, 371-378, https://doi.org/10.1016/S0021-9673(01)94539-X
. [all data]