1-Butanethiol, 3-methyl-
- Formula: C5H12S
- Molecular weight: 104.214
- IUPAC Standard InChIKey: GIJGXNFNUUFEGH-UHFFFAOYSA-N
- CAS Registry Number: 541-31-1
- Chemical structure:
View 3d structure (requires JavaScript / HTML 5) - Other names: Isoamyl mercaptan; Isoamyl sulfhydrate; Isopentyl mercaptan; 2-Methyl-4-butanethiol; 3-Methyl-1-butanethiol; 3-Methylbutanethiol; 3-Methyl-1-butylthiol; 3-Methylbutan-1-thiol; 3-methylbutane-1-thiol

Gas phase thermochemistry data

Data compiled by: Hussein Y. Afeefy, Joel F. Liebman, and Stephen E. Stein
Quantity | Value | Units | Method | Reference | Comment |
---|---|---|---|---|---|
ΔfH°gas | -114.6 ± 1.2 | kJ/mol | Ccr | Good, 1972 |

Condensed phase thermochemistry data

Data compiled as indicated in comments:
ALS - Hussein Y. Afeefy, Joel F. Liebman, and Stephen E. Stein
DH - Eugene S. Domalski and Elizabeth D. Hearing
Quantity | Value | Units | Method | Reference | Comment |
---|---|---|---|---|---|
ΔfH°liquid | -154.1 ± 1.2 | kJ/mol | Ccr | Good, 1972 | ALS |
Quantity | Value | Units | Method | Reference | Comment |
ΔcH°liquid | -4130.5 ± 1.1 | kJ/mol | Ccr | Good, 1972 | Reanalyzed by Pedley, Naylor, et al., 1986, Original value = -4130.0 ± 1.1 kJ/mol; ALS |
Quantity | Value | Units | Method | Reference | Comment |
S°liquid | 298.49 | J/mol*K | N/A | Messerly, Finke, et al., 1974 | DH |
Constant pressure heat capacity of liquid
Cp,liquid (J/mol*K) | Temperature (K) | Reference | Comment |
---|---|---|---|
200.33 | 298.15 | Messerly, Finke, et al., 1974 | T = 12 to 370 K.; DH |
Constant pressure heat capacity of solid
Cp,solid (J/mol*K) | Temperature (K) | Reference | Comment |
---|---|---|---|
93.72 | 103. | Messerly, Finke, et al., 1974 | glass phase; T = 10 to 103 K.; DH |

Phase change data

Data compiled as indicated in comments:
BS - Robert L. Brown and Stephen E. Stein
TRC - Thermodynamics Research Center, NIST Boulder Laboratories, Chris Muzny director
ALS - Hussein Y. Afeefy, Joel F. Liebman, and Stephen E. Stein
DRB - Donald R. Burgess, Jr.
AC - William E. Acree, Jr., James S. Chickos
DH - Eugene S. Domalski and Elizabeth D. Hearing
Quantity | Value | Units | Method | Reference | Comment |
---|---|---|---|---|---|
Tboil | 391.2 | K | N/A | Weast and Grasselli, 1989 | BS |
Quantity | Value | Units | Method | Reference | Comment |
Ttriple | 139.630 | K | N/A | Messerly, Finke, et al., 1974, 2 | Uncertainty assigned by TRC = 0.005 K; TRC |
Quantity | Value | Units | Method | Reference | Comment |
ΔvapH° | 39.4 ± 0.2 | kJ/mol | V | Good, 1972 | ALS |
ΔvapH° | 39.5 | kJ/mol | N/A | Good, 1972 | DRB |
ΔvapH° | 39.9 ± 0.1 | kJ/mol | N/A | Good, 1972 | See also Osborn and Douslin, 1966.; AC |
ΔvapH° | 39.7 | kJ/mol | N/A | Reid, 1972 | AC |
Enthalpy of vaporization
ΔvapH (kJ/mol) | Temperature (K) | Method | Reference | Comment |
---|---|---|---|---|
39.3 | 307. | N/A | Dykyj, Svoboda, et al., 1999 | Based on data from 292. to 418. K.; AC |
37.7 | 338. | A,EB | Stephenson and Malanowski, 1987 | Based on data from 323. to 431. K. See also Osborn and Douslin, 1966.; AC |
Antoine Equation Parameters
log10(P) = A − (B / (T + C))
P = vapor pressure (bar)
T = temperature (K)
View plot Requires a JavaScript / HTML 5 canvas capable browser.
Temperature (K) | A | B | C | Reference |
---|---|---|---|---|
324.10 to 430.77 | 4.03981 | 1342.509 | -58.704 | Osborn and Douslin, 1966 |
Enthalpy of fusion
ΔfusH (kJ/mol) | Temperature (K) | Reference | Comment |
---|---|---|---|
7.406 | 139.635 | Messerly, Finke, et al., 1974 | DH |
7.41 | 139.6 | Domalski and Hearing, 1996 | AC |
Entropy of fusion
ΔfusS (J/mol*K) | Temperature (K) | Reference | Comment |
---|---|---|---|
53.04 | 139.635 | Messerly, Finke, et al., 1974 | DH |

References

Good, 1972
Good, W.D.,
Enthalpies of combustion of 18 organic sulfur compounds related to petroleum,
J. Chem. Eng. Data, 1972, 17, 158-162. [all data]
Pedley, Naylor, et al., 1986
Pedley, J.B.; Naylor, R.D.; Kirby, S.P.,
Thermochemical Data of Organic Compounds, Chapman and Hall, New York, 1986, 1-792. [all data]
Messerly, Finke, et al., 1974
Messerly, J.F.; Finke, H.L.; Todd, S.S.,
Low-temperature thermal studies on six organo-sulfur compounds,
J. Chem. Thermodynam., 1974, 6, 635-657. [all data]
Weast and Grasselli, 1989
CRC Handbook of Data on Organic Compounds, 2nd Editon, Weast,R.C and Grasselli, J.G., ed(s)., CRC Press, Inc., Boca Raton, FL, 1989, 1. [all data]
Messerly, Finke, et al., 1974, 2
Messerly, J.F.; Finke, H.L.; Todd, S.S.,
Low-temperature thermal sudies on six organo-sulfur compounds,
J. Chem. Thermodyn., 1974, 6, 635-57. [all data]
Osborn and Douslin, 1966
Osborn, A.G.; Douslin, D.R.,
Vapor Pressure Relations of 36 Sulfur Compounds Present in Petroleum.,
J. Chem. Eng. Data, 1966, 11, 4, 502-509, https://doi.org/10.1021/je60031a014
. [all data]
Reid, 1972
Reid, Robert C.,
Handbook on vapor pressure and heats of vaporization of hydrocarbons and related compounds, R. C. Wilhort and B. J. Zwolinski, Texas A Research Foundation. College Station, Texas(1971). 329 pages.$10.00,
AIChE J., 1972, 18, 6, 1278-1278, https://doi.org/10.1002/aic.690180637
. [all data]
Dykyj, Svoboda, et al., 1999
Dykyj, J.; Svoboda, J.; Wilhoit, R.C.; Frenkel, M.L.; Hall, K.R.,
Vapor Pressure of Chemicals: Part A. Vapor Pressure and Antoine Constants for Hydrocarbons and Sulfur, Selenium, Tellurium and Hydrogen Containing Organic Compounds, Springer, Berlin, 1999, 373. [all data]
Stephenson and Malanowski, 1987
Stephenson, Richard M.; Malanowski, Stanislaw,
Handbook of the Thermodynamics of Organic Compounds, 1987, https://doi.org/10.1007/978-94-009-3173-2
. [all data]
Domalski and Hearing, 1996
Domalski, Eugene S.; Hearing, Elizabeth D.,
Heat Capacities and Entropies of Organic Compounds in the Condensed Phase. Volume III,
J. Phys. Chem. Ref. Data, 1996, 25, 1, 1, https://doi.org/10.1063/1.555985
. [all data]