2,2,2-Trifluoro-N-[1,2,2,2-tetrafluoro-1-(trifluoromethyl)ethyl]ethanimidic acid, 1,2,2,2-tetrafluoro-1-(trifluoromethyl)ethyl ester

Phase change data

Data compiled by: William E. Acree, Jr., James S. Chickos

Enthalpy of vaporization

ΔvapH (kJ/mol) Temperature (K) Reference
37.6385.Peterman and Shreeve, 1975

References

Peterman and Shreeve, 1975
Peterman, Keith E.; Shreeve, Jean'ne M., F-N-Isopropylacetimidoyl chloride. Precursor to totally and partially fluorinated imido esters and imido thio esters, Inorg. Chem., 1975, 14, 5, 1106-1110, https://doi.org/10.1021/ic50147a029 . [all data]