1,3-Diphenyl-2,3-epoxy-1-propanone
- Formula: C15H12O2
- Molecular weight: 224.2546
- IUPAC Standard InChIKey: UQGMJZQVDNZRKT-UHFFFAOYSA-N
- CAS Registry Number: 5411-12-1
- Chemical structure:
View 3d structure (requires JavaScript / HTML 5) - Other names: Chalcone trans-α,β-epoxide; Chalcone-α,β-epoxide; Methanone, phenyl(3-phenyloxiranyl)-; phenyl (3-phenyloxiranyl) ketone

Condensed phase thermochemistry data

Data compiled by: Hussein Y. Afeefy, Joel F. Liebman, and Stephen E. Stein
Quantity | Value | Units | Method | Reference | Comment |
---|---|---|---|---|---|
ΔfH°solid | -128. | kJ/mol | Ccb | Moureu, 1930 | |
Quantity | Value | Units | Method | Reference | Comment |
ΔcH°solid | -7522.0 | kJ/mol | Ccb | Moureu, 1930 | Corresponding ΔfHºsolid = -95.8 kJ/mol (simple calculation by NIST; no Washburn corrections) |

References

Moureu, 1930
Moureu, M.H.,
Des sur la tautomerie des dicetones α,
Ann. Chem., 1930, 14, 283-405. [all data]