Dibenzofuran, 2,8-dichloro-
- Formula: C12H6Cl2O
- Molecular weight: 237.081
- IUPAC Standard InChIKey: IVVRJIDVYSPKFZ-UHFFFAOYSA-N
- CAS Registry Number: 5409-83-6
- Chemical structure:
View 3d structure (requires JavaScript / HTML 5) - Other names: 2,8-Dichlorodibenzo[b,d]furan; 2,8-Dichlorodibenzofuran

Phase change data

Data compiled by: William E. Acree, Jr., James S. Chickos
Enthalpy of sublimation
ΔsubH (kJ/mol) | Temperature (K) | Method | Reference | Comment |
---|---|---|---|---|
110.3 ± 1.2 | 360. | ME | Li, Shibata, et al., 2004 | Based on data from 348. to 383. K. |

Van Den Dool and Kratz RI, non-polar column, temperature ramp

Column type | Active phase | I | Reference | Comment |
---|---|---|---|---|
Capillary | DB-5 | 1935. | Hale, Hileman, et al., 1985 | He, 175. C @ 1. min, 6. K/min; Column length: 30. m; Tend: 180. C |

Van Den Dool and Kratz RI, non-polar column, custom temperature program

Column type | Active phase | I | Reference | Comment |
---|---|---|---|---|
Capillary | HP-5 | 1936. | Korhonen and Mantykoski, 1989 | 25. m/0.20 mm/0.11 μm, He; Program: 100 0C (1 min) 20 0C/min -> 180 0C 5 0C/min -> 290 0C (until elution of the last peak) |

Normal alkane RI, non-polar column, custom temperature program

Column type | Active phase | I | Reference | Comment |
---|---|---|---|---|
Capillary | DB-5 | 1935. | N/A | Program: not specified |

References

Li, Shibata, et al., 2004
Li, Xian-Wei; Shibata, Etsuro; Kasai, Eiki; Nakamura, Takashi,
VAPOR PRESSURES AND ENTHALPIES OF SUBLIMATION OF 17 POLYCHLORINATED DIBENZO-p-DIOXINS AND FIVE POLYCHLORINATED DIBENZOFURANS,
Environ Toxicol Chem, 2004, 23, 2, 348-808, https://doi.org/10.1897/03-193
. [all data]