Butane, 2,3-dibromo-
- Formula: C4H8Br2
- Molecular weight: 215.914
- IUPAC Standard InChIKey: BXXWFOGWXLJPPA-UHFFFAOYSA-N
- CAS Registry Number: 5408-86-6
- Chemical structure:
View 3d structure (requires JavaScript / HTML 5) - Species with the same structure:
- Stereoisomers:
- Other names: 2,3-Dibromobutane; β-Butylene bromide; DL-2,3-Dibromobutane

Phase change data

Data compiled as indicated in comments:
TRC - Thermodynamics Research Center, NIST Boulder Laboratories, Chris Muzny director
BS - Robert L. Brown and Stephen E. Stein
ALS - Hussein Y. Afeefy, Joel F. Liebman, and Stephen E. Stein
Quantity | Value | Units | Method | Reference | Comment |
---|---|---|---|---|---|
Tboil | 431. | K | N/A | Pauling, Springall, et al., 1939 | Uncertainty assigned by TRC = 2. K; TRC |
Tboil | 431.15 | K | N/A | Coffin and Maass, 1928 | Uncertainty assigned by TRC = 1.5 K; TRC |
Reduced pressure boiling point
Tboil (K) | Pressure (bar) | Reference | Comment |
---|---|---|---|
378.7 | 0.213 | Aldrich Chemical Company Inc., 1990 | BS |
Enthalpy of vaporization
ΔvapH (kJ/mol) | Temperature (K) | Method | Reference | Comment |
---|---|---|---|---|
37.7 | 295. | V | Trieschmann, 1936 | ALS |

Reaction thermochemistry data

Data compiled by: Hussein Y. Afeefy, Joel F. Liebman, and Stephen E. Stein
Individual Reactions
By formula: C4H8Br2 = C4H8Br2
Quantity | Value | Units | Method | Reference | Comment |
---|---|---|---|---|---|
ΔrH° | -8.3 ± 0.3 | kJ/mol | Eqk | Nesterova, Rozhnov, et al., 1973 | liquid phase |
By formula: C4H8Br2 = C4H8Br2
Quantity | Value | Units | Method | Reference | Comment |
---|---|---|---|---|---|
ΔrH° | -2.1 ± 0.08 | kJ/mol | Eqk | Nesterova, Rozhnov, et al., 1973 | liquid phase |
By formula: C4H8Br2 = C4H8Br2
Quantity | Value | Units | Method | Reference | Comment |
---|---|---|---|---|---|
ΔrH° | -13. ± 0.8 | kJ/mol | Eqk | Nesterova, Rozhnov, et al., 1973, 2 | gas phase |

Normal alkane RI, non-polar column, temperature ramp

Column type | Active phase | I | Reference | Comment |
---|---|---|---|---|
Capillary | HP-PONA | 904. | Liu and Yang, 2003 | 50. m/0.20 mm/0.50 μm, 35. C @ 8. min, 3.5 K/min, 230. C @ 10. min |
Capillary | HP-PONA | 882. | Liu and Yang, 2003 | 50. m/0.20 mm/0.50 μm, 35. C @ 8. min, 3.5 K/min, 230. C @ 10. min |

Normal alkane RI, non-polar column, custom temperature program

Column type | Active phase | I | Reference | Comment |
---|---|---|---|---|
Capillary | Methyl Silicone | 916. | Zenkevich and Marinichev, 2001 | Program: not specified |

References

Pauling, Springall, et al., 1939
Pauling, L.; Springall, H.D.; Palmer, K.J.,
The Electron Diffraction Investigation of Methylacetylene, Dimethyl- acetylene, Dimethyldiacetylene, Methyl Cyanide, Diacetylene and Cyanogen cyanogen,
J. Am. Chem. Soc., 1939, 61, 927-8. [all data]
Coffin and Maass, 1928
Coffin, C.C.; Maass, O.,
The Preparation and Physical Properties of α-,β- and γ-Butylene and Normal and Isobutane,
J. Am. Chem. Soc., 1928, 50, 1427-37. [all data]
Aldrich Chemical Company Inc., 1990
Aldrich Chemical Company Inc.,
Catalog Handbook of Fine Chemicals, Aldrich Chemical Company, Inc., Milwaukee WI, 1990, 1. [all data]
Trieschmann, 1936
Trieschmann, H.G.,
Untersuchungen uber zwischenmolekulare kraftwirkungen an den isomeren 2,3-dibrombutane,
Z. Phys. Chem., 1936, 33, 283-289. [all data]
Nesterova, Rozhnov, et al., 1973
Nesterova, T.N.; Rozhnov, A.M.; Kovaleva, T.V.,
Isomerisation equilibrium of 1,2-, 1,3-, and 2,3-dibromobutanes,
Russ. J. Phys. Chem. (Engl. Transl.), 1973, 47, 755-756. [all data]
Nesterova, Rozhnov, et al., 1973, 2
Nesterova, T.N.; Rozhnov, A.M.; Borodenko, N.A.,
Equilibrium of 2,2- and 2,3-dibromobutane isomerization,
Izv. Vyssh. Uchebn. Zaved., Khim. Khim. Tekhnol., 1973, 16, 1216-1218. [all data]
Liu and Yang, 2003
Liu, Y.; Yang, H.,
Detailed alkene determination by bromination and gas chromatography with atomic emission detection. I. identification of the bromoalkenes/bromoalkanes in brominated gasoline,
Se Pu - Chinese Journal of Chromatography, 2003, 21, 1, 1-8. [all data]
Zenkevich and Marinichev, 2001
Zenkevich, I.G.; Marinichev, A.N.,
Comparison of Topological and Dynamics Molecular Characteristics for Precalculation of Chromatographic Retention Parameters of Organic Compounds (in Russian),
Zh. Struct. Khim., 2001, 42, 5, 893-902. [all data]