Acetic acid, 1,1-dimethylethyl ester
- Formula: C6H12O2
- Molecular weight: 116.1583
- IUPAC Standard InChIKey: WMOVHXAZOJBABW-UHFFFAOYSA-N
- CAS Registry Number: 540-88-5
- Chemical structure:
View 3d structure (requires JavaScript / HTML 5) - Other names: Acetic acid, tert-butyl ester; tert-Butyl acetate; Texaco lead appreciator; CH3C(O)OC(CH3)3; t-Butyl acetate; tert-Butyl ethanoate; TLA; Acetic acid t-butyl ester; 1,1-Dimethylethyl acetate; NSC 59719

Gas phase thermochemistry data

Data compiled by: Hussein Y. Afeefy, Joel F. Liebman, and Stephen E. Stein
Quantity | Value | Units | Method | Reference | Comment |
---|---|---|---|---|---|
ΔfH°gas | -516.5 ± 1.3 | kJ/mol | Ccb | Verevkin, Beckhaus, et al., 1996 |

Condensed phase thermochemistry data

Data compiled as indicated in comments:
ALS - Hussein Y. Afeefy, Joel F. Liebman, and Stephen E. Stein
DH - Eugene S. Domalski and Elizabeth D. Hearing
Quantity | Value | Units | Method | Reference | Comment |
---|---|---|---|---|---|
ΔfH°liquid | -554.5 ± 1.3 | kJ/mol | Ccb | Verevkin, Beckhaus, et al., 1996 | ALS |
Quantity | Value | Units | Method | Reference | Comment |
ΔcH°liquid | -3521.5 ± 1.3 | kJ/mol | Ccb | Verevkin, Beckhaus, et al., 1996 | Corresponding ΔfHºliquid = -554.5 kJ/mol (simple calculation by NIST; no Washburn corrections); ALS |
Constant pressure heat capacity of liquid
Cp,liquid (J/mol*K) | Temperature (K) | Reference | Comment |
---|---|---|---|
231.0 | 298.15 | Fuchs, 1979 | DH |

Phase change data

Data compiled as indicated in comments:
BS - Robert L. Brown and Stephen E. Stein
TRC - Thermodynamics Research Center, NIST Boulder Laboratories, Chris Muzny director
ALS - Hussein Y. Afeefy, Joel F. Liebman, and Stephen E. Stein
DRB - Donald R. Burgess, Jr.
AC - William E. Acree, Jr., James S. Chickos
Quantity | Value | Units | Method | Reference | Comment |
---|---|---|---|---|---|
Tboil | 370.7 | K | N/A | Weast and Grasselli, 1989 | BS |
Tboil | 369. | K | N/A | American Tokyo Kasei, 1988 | BS |
Tboil | 369. | K | N/A | Ogata and Aoki, 1969 | Uncertainty assigned by TRC = 3. K; TRC |
Tboil | 369.2 | K | N/A | Houtman, Van Steenis, et al., 1946 | Uncertainty assigned by TRC = 2. K; TRC |
Tboil | 371.0 | K | N/A | Norris and Rigby, 1932 | Uncertainty assigned by TRC = 0.4 K; TRC |
Quantity | Value | Units | Method | Reference | Comment |
ΔvapH° | 38.03 ± 0.21 | kJ/mol | V | Verevkin, Beckhaus, et al., 1996 | ALS |
ΔvapH° | 38.0 | kJ/mol | N/A | Verevkin, Beckhaus, et al., 1996 | DRB |
ΔvapH° | 38.0 ± 0.2 | kJ/mol | C | Wadsö, Murto, et al., 1966 | See also Verevkin, Beckhaus, et al., 1996.; AC |
ΔvapH° | 38.0 ± 0.2 | kJ/mol | C | Wadso, 1966 | ALS |
Enthalpy of vaporization
ΔvapH (kJ/mol) | Temperature (K) | Reference | Comment |
---|---|---|---|
36.7 | 323. | Montón, Muñoz, et al., 2005 | Based on data from 308. to 372. K.; AC |

Reaction thermochemistry data

Data compiled by: Hussein Y. Afeefy, Joel F. Liebman, and Stephen E. Stein
Individual Reactions
By formula: C2H2O + C4H10O = C6H12O2
Quantity | Value | Units | Method | Reference | Comment |
---|---|---|---|---|---|
ΔrH° | -98.28 | kJ/mol | Cm | Rice and Greenberg, 1934 | liquid phase |

Normal alkane RI, non-polar column, custom temperature program

Data compiled by: NIST Mass Spectrometry Data Center, William E. Wallace, director

Column type CapillaryCapillaryCapillary
Active phase Methyl SiliconeSE-30OV-1, SE-30, Methyl silicone, SP-2100, OV-101, DB-1, etc.
Column length (m)   50.
Carrier gas   Hydrogen
Substrate
Column diameter (mm)   0.32
Phase thickness (μm)
Program not specifiednot specifiednot specified
I 686.676.687.
ReferenceDu and Feng, 2008Vinogradov, 2004Waggott and Davies, 1984
Comment MSDC-RI MSDC-RI MSDC-RI

Kovats' RI, polar column, isothermal

Data compiled by: NIST Mass Spectrometry Data Center, William E. Wallace, director

Column type PackedPacked
Active phase Carbowax 20MCarbowax 20M
Column length (m) 3.2.
Carrier gas
Substrate Chromosorb WAW (60-80 mesh)Chromosorb W
Column diameter (mm)
Phase thickness (μm)
Temperature (C) 100.100.
I 888.845.
ReferenceChastrette, Heintz, et al., 1974Zarazir, Chovin, et al., 1970
Comment MSDC-RI MSDC-RI

References

Verevkin, Beckhaus, et al., 1996
Verevkin, S.P.; Beckhaus, H.-D.; Belen'kaja, R.S.; Rakus, K.; Ruchardt, C.,
Geminal substituent effects Part 9. Standard enthalpies of formation and strain free increments of branched esters and ethers,
Thermochim. Acta, 1996, 279, 47-64. [all data]
Fuchs, 1979
Fuchs, R.,
Heat capacities of some liquid aliphatic, alicyclic, and aromatic esters at 298.15 K,
J. Chem. Thermodyn., 1979, 11, 959-961. [all data]
Weast and Grasselli, 1989
CRC Handbook of Data on Organic Compounds, 2nd Editon, Weast,R.C and Grasselli, J.G., ed(s)., CRC Press, Inc., Boca Raton, FL, 1989, 1. [all data]
American Tokyo Kasei, 1988
American Tokyo Kasei,
TCI American Organic Chemical 88/89 Catalog, American Tokyo Kasei, Portland, OR, 1988, 1610. [all data]
Ogata and Aoki, 1969
Ogata, Y.; Aoki, K.,
Reaction of Alkyl Iodides with Peracetic Acid in the Presence of Aromatic Compounds,
J. Org. Chem., 1969, 34, 3974. [all data]
Houtman, Van Steenis, et al., 1946
Houtman, J.P.W.; Van Steenis, J.; Heertjes, P.M.,
Recl. Trav. Chim. Pays-Bas, 1946, 65, 781. [all data]
Norris and Rigby, 1932
Norris, J.F.; Rigby, G.W.,
Reactivity of Atoms and Groups in Organic Compounds XII. The Preparation and Properties of Mixed Aliphatic Ethers with Special Reference to those Containing the Tert-Butyl Radical,
J. Am. Chem. Soc., 1932, 54, 2088. [all data]
Wadsö, Murto, et al., 1966
Wadsö, Ingemar; Murto, Maija-Leena; Bergson, Göran; Ehrenberg, L.; Brunvoll, J.; Bunnenberg, E.; Djerassi, Carl; Records, Ruth,
Heats of Vaporization for a Number of Organic Compounds at 25 degrees C.,
Acta Chem. Scand., 1966, 20, 544-552, https://doi.org/10.3891/acta.chem.scand.20-0544
. [all data]
Wadso, 1966
Wadso, I.,
Acta Chem. Scand., 1966, 20, 544. [all data]
Montón, Muñoz, et al., 2005
Montón, J.B.; Muñoz, R.; Burguet, M.C.; Torre, J. de la,
Isobaric vapor--liquid equilibria for the binary systems isobutyl alcohol+isobutyl acetate and tert-butyl alcohol+tert-butyl acetate at 20 and 101.3kPa,
Fluid Phase Equilibria, 2005, 227, 1, 19-25, https://doi.org/10.1016/j.fluid.2004.10.022
. [all data]