Cyclobutyl phenyl ketone
- Formula: C11H12O
- Molecular weight: 160.2124
- IUPAC Standard InChIKey: MVEBDOSCXOQNAR-UHFFFAOYSA-N
- CAS Registry Number: 5407-98-7
- Chemical structure:
View 3d structure (requires JavaScript / HTML 5) - Other names: Benzoylcyclobutane; Methanone, (cyclobutyl)(phenyl)-

Phase change data

Data compiled by: Robert L. Brown and Stephen E. Stein
Quantity | Value | Units | Method | Reference | Comment |
---|---|---|---|---|---|
Tboil | 533.2 | K | N/A | Weast and Grasselli, 1989 | |
Tboil | 533. | K | N/A | Buckingham and Donaghy, 1982 |
Reduced pressure boiling point
Tboil (K) | Pressure (bar) | Reference |
---|---|---|
389.2 | 0.009 | Aldrich Chemical Company Inc., 1990 |
404. to 406. | 0.020 | Frinton Laboratories Inc., 1986 |

References

Weast and Grasselli, 1989
CRC Handbook of Data on Organic Compounds, 2nd Editon, Weast,R.C and Grasselli, J.G., ed(s)., CRC Press, Inc., Boca Raton, FL, 1989, 1. [all data]
Buckingham and Donaghy, 1982
Buckingham, J.; Donaghy, S.M.,
Dictionary of Organic Compounds: Fifth Edition, Chapman and Hall, New York, 1982, 1. [all data]
Aldrich Chemical Company Inc., 1990
Aldrich Chemical Company Inc.,
Catalog Handbook of Fine Chemicals, Aldrich Chemical Company, Inc., Milwaukee WI, 1990, 1. [all data]
Frinton Laboratories Inc., 1986
Frinton Laboratories Inc.,
Catalog Number 11, Frinton Laboratories Inc., Vineland, NJ, 1986, 99. [all data]
Mariella and Raube, 1952
Mariella, R.P.; Raube, R.R.,
Ultraviolet absorption spectra of alicyclic compounds. III. Phenyl cycloalkyl and styryl cycloalkyl ketones,
J. Am. Chem. Soc., 1952, 74, 521-524. [all data]