2,5,5-trimethyl-2-phenyl-1,3-dioxane

Condensed phase thermochemistry data

Data compiled by: Hussein Y. Afeefy, Joel F. Liebman, and Stephen E. Stein

Quantity Value Units Method Reference Comment
Δfliquid-414.52 ± 0.80kJ/molCcrVerevkin, Dogan, et al., 1995See Beckhaus, Dogan, et al., 1990
Quantity Value Units Method Reference Comment
Δcliquid-7273.57 ± 0.76kJ/molCcrVerevkin, Dogan, et al., 1995See Beckhaus, Dogan, et al., 1990; Corresponding Δfliquid = -414.53 kJ/mol (simple calculation by NIST; no Washburn corrections)

Phase change data

Data compiled as indicated in comments:
ALS - Hussein Y. Afeefy, Joel F. Liebman, and Stephen E. Stein
DRB - Donald R. Burgess, Jr.

Quantity Value Units Method Reference Comment
Δvap63.84 ± 0.31kJ/molVVerevkin, Dogan, et al., 1995See Beckhaus, Dogan, et al., 1990; ALS
Δvap63.8kJ/molN/AVerevkin, Dogan, et al., 1995DRB

Gas phase thermochemistry data

Data compiled by: Hussein Y. Afeefy, Joel F. Liebman, and Stephen E. Stein

Quantity Value Units Method Reference Comment
Δfgas-83.81 ± 0.21kcal/molCcrVerevkin, Dogan, et al., 1995See Beckhaus, Dogan, et al., 1990

References

Verevkin, Dogan, et al., 1995
Verevkin, S.P.; Dogan, B.; Hdrich, J.; Beckhaus, H.-D.; Rchardt, C., Geminal substituent effects. VIII. Enthalpies of formation of acetals, J. Prakt. Chem., 1995, 337, 93-98. [all data]

Beckhaus, Dogan, et al., 1990
Beckhaus, H.D.; Dogan, B.; Verevkin, S.; Hadrich, J.; Ruchardt, C., Dependence of anomeric stabilization on structure in acetals, Angew. Chem. Int. Ed. Engl., 1990, 29, 320-321. [all data]