octane, 6-chloro-2,6-dimethyl-

Phase change data

Data compiled by: Thermodynamics Research Center, NIST Boulder Laboratories, Chris Muzny director

Quantity Value Units Method Reference Comment
Tboil450.KN/APetrov and Chel'tsova, 1942Uncertainty assigned by TRC = 5. K

In addition to the Thermodynamics Research Center (TRC) data available from this site, much more physical and chemical property data is available from the following TRC products:

References

Petrov and Chel'tsova, 1942
Petrov, A.D.; Chel'tsova, M.A., Synthesis and Properties of Hydrocarbons of the Aromatic and Naphthenic Series of the Composition C19-C26. II., J. Gen. Chem. USSR (Engl. Transl.), 1942, 12, 87-94. [all data]