3-Hexanone, 2,2-dimethyl-
- Formula: C8H16O
- Molecular weight: 128.2120
- IUPAC Standard InChIKey: PYCHXHVFOZBVEY-UHFFFAOYSA-N
- CAS Registry Number: 5405-79-8
- Chemical structure:
View 3d structure (requires JavaScript / HTML 5) - Other names: tert-Butyl Propyl ketone; 2,2-Dimethyl-3-hexanone; 2,2-DIMETHYLHEXAN-3-ONE

Phase change data

Data compiled by: Thermodynamics Research Center, NIST Boulder Laboratories, Chris Muzny director
Quantity | Value | Units | Method | Reference | Comment |
---|---|---|---|---|---|
Tboil | 419. | K | N/A | Foley, Welch, et al., 1960 | Uncertainty assigned by TRC = 2. K |
Tboil | 417. | K | N/A | Stutsman and Adkins, 1939 | Uncertainty assigned by TRC = 3. K |
Tboil | 420. | K | N/A | Leroide, 1921 | Uncertainty assigned by TRC = 3. K |
Tboil | 420. | K | N/A | Haller and Bauer, 1913 | Uncertainty assigned by TRC = 3. K |

References

Foley, Welch, et al., 1960
Foley, W.M.; Welch, F.J.; Lacombe, E.M.; Mosher, H.S.,
J. Am. Chem. Soc., 1960, 81, 2779-81. [all data]
Stutsman and Adkins, 1939
Stutsman, P.S.; Adkins, H.,
Hydrogenation of 1,3-Diketones to Ketols,
J. Am. Chem. Soc., 1939, 61, 3303-6. [all data]
Leroide, 1921
Leroide, J.,
Ann. Chim. (Paris), 1921, 16, 354. [all data]
Haller and Bauer, 1913
Haller, A.; Bauer, E.,
Ann. Chim. (Paris), 1913, 29, 8, 313. [all data]