[1-(1-methylethyl)ethenyl]cyclopropane
- Formula: C8H14
- Molecular weight: 110.1968
- IUPAC Standard InChIKey: ISMFOBHMADMIFL-UHFFFAOYSA-N
- CAS Registry Number: 5405-78-7
- Chemical structure:
View 3d structure (requires JavaScript / HTML 5) - Permanent link for this species. Use this link for bookmarking this species for future reference.

Phase change data

Data compiled by: Thermodynamics Research Center, NIST Boulder Laboratories, Chris Muzny director
Quantity | Value | Units | Method | Reference | Comment |
---|---|---|---|---|---|
Tboil | 389.96 | K | N/A | Slabey, 1952 | Uncertainty assigned by TRC = 0.5 K |
Quantity | Value | Units | Method | Reference | Comment |
Tfus | 147.17 | K | N/A | Slabey, 1952 | Uncertainty assigned by TRC = 1. K |

References

Slabey, 1952
Slabey, V.A.,
Synthesis and purification of 2-cyclopropyl-3-methyl-1-butene and 2-cyclopropyl-3-methylbutane,
J. Am. Chem. Soc., 1952, 74, 4963-4. [all data]