1,2-Dibromoethylene
- Formula: C2H2Br2
- Molecular weight: 185.845
- IUPAC Standard InChIKey: UWTUEMKLYAGTNQ-UHFFFAOYSA-N
- CAS Registry Number: 540-49-8
- Chemical structure:
View 3d structure (requires JavaScript / HTML 5) - Stereoisomers:
- Other names: Ethene, 1,2-dibromo-; Ethylene, 1,2-dibromo-; s-Dibromoethylene; Acetylene dibromide; 1,2-Dibromoethene; sym-Dibromoethylene; 2-Bromovinyl bromide; NSC 8744

Phase change data

Data compiled as indicated in comments:
TRC - Thermodynamics Research Center, NIST Boulder Laboratories, Chris Muzny director
BS - Robert L. Brown and Stephen E. Stein
Quantity | Value | Units | Method | Reference | Comment |
---|---|---|---|---|---|
Tboil | 385. | K | N/A | Andrews and Keefer, 1951 | Uncertainty assigned by TRC = 2. K; sample consists of 35% trans- and 65% cis-isomers; TRC |
Quantity | Value | Units | Method | Reference | Comment |
Tfus | 283. | K | N/A | Timmermans, 1935 | Uncertainty assigned by TRC = 1.5 K; TRC |
Reduced pressure boiling point
Tboil (K) | Pressure (bar) | Reference | Comment |
---|---|---|---|
383.2 | 1.01 | Aldrich Chemical Company Inc., 1990 | BS |

References

Andrews and Keefer, 1951
Andrews, L.J.; Keefer, R.M.,
The Argentation of Organic Iodides,
J. Am. Chem. Soc., 1951, 73, 5733-5736. [all data]
Timmermans, 1935
Timmermans, J.,
Researches in Stoichiometry. I. The Heat of Fusion of Organic Compounds.,
Bull. Soc. Chim. Belg., 1935, 44, 17-40. [all data]
Aldrich Chemical Company Inc., 1990
Aldrich Chemical Company Inc.,
Catalog Handbook of Fine Chemicals, Aldrich Chemical Company, Inc., Milwaukee WI, 1990, 1. [all data]