Butanoic acid, pentyl ester

Phase change data

Data compiled as indicated in comments:
TRC - Thermodynamics Research Center, NIST Boulder Laboratories, Chris Muzny director
DH - Eugene S. Domalski and Elizabeth D. Hearing

Quantity Value Units Method Reference Comment
Tboil451.75KN/AHoffmann, 1959Uncertainty assigned by TRC = 1. K; TRC
Tboil449.KN/AGill and Dexter, 1934Uncertainty assigned by TRC = 2. K; TRC
Tboil459.5KN/ALievens, 1924Uncertainty assigned by TRC = 0.5 K; TRC
Quantity Value Units Method Reference Comment
Ttriple200.48KN/AVasil'ev and Petrov, 1984Uncertainty assigned by TRC = 0.02 K; TRC

In addition to the Thermodynamics Research Center (TRC) data available from this site, much more physical and chemical property data is available from the following TRC products:

Normal alkane RI, polar column, temperature ramp

Data compiled by: NIST Mass Spectrometry Data Center, William E. Wallace, director

Column type CapillaryCapillary
Active phase DB-WaxCarbowax 20M
Column length (m) 60.80.
Carrier gas H2
Substrate
Column diameter (mm) 0.320.2
Phase thickness (μm) 0.25
Tstart (C) 60.70.
Tend (C) 220.170.
Heat rate (K/min) 3.2.
Initial hold (min)
Final hold (min)
I 1304.1305.
ReferenceWerkhoff, Güntert, et al., 1998Egolf and Jurs, 1993
Comment MSDC-RI MSDC-RI

Kovats' RI, polar column, isothermal

Data compiled by: NIST Mass Spectrometry Data Center, William E. Wallace, director

Column type PackedPacked
Active phase Carbowax 20MCarbowax 20M
Column length (m) 3.2.
Carrier gas
Substrate Chromosorb WAW (60-80 mesh)Chromosorb W
Column diameter (mm)
Phase thickness (μm)
Temperature (C) 100.100.
I 1305.1326.
ReferenceChastrette, Heintz, et al., 1974Zarazir, Chovin, et al., 1970
Comment MSDC-RI MSDC-RI

Kovats' RI, non-polar column, custom temperature program

Data compiled by: NIST Mass Spectrometry Data Center, William E. Wallace, director

Column type Capillary
Active phase SE-30
Column length (m)
Carrier gas
Substrate
Column diameter (mm)
Phase thickness (μm)
Program not specified
I 1062.
ReferenceChretien and Dubois, 1978
Comment MSDC-RI

References

Hoffmann, 1959
Hoffmann, W.L., Riechst. Aromen, 1959, 9, 273. [all data]

Gill and Dexter, 1934
Gill, A.H.; Dexter, F.P., Ind. Eng. Chem., 1934, 26, 881. [all data]

Lievens, 1924
Lievens, G., The freezing point of organic substances: viii esters containing a normal c(5) radical, Bull. Soc. Chim. Belg., 1924, 33, 122-131. [all data]

Vasil'ev and Petrov, 1984
Vasil'ev, I.A.; Petrov, V.M., Thermodynamic Properties of Oxygen-containing Organic Compounds, Handbook, Soedinenii: Khimya, Leningrad, p 240, 1984. [all data]