Cyclohexane, 1,2-dibromo-
- Formula: C6H10Br2
- Molecular weight: 241.952
- IUPAC Standard InChIKey: CZNHKZKWKJNOTE-UHFFFAOYSA-N
- CAS Registry Number: 5401-62-7
- Chemical structure:
View 3d structure (requires JavaScript / HTML 5) - Stereoisomers:
- Other names: 1,2-Dibromocyclohexane

Gas phase thermochemistry data

Data compiled by: Hussein Y. Afeefy, Joel F. Liebman, and Stephen E. Stein
Quantity | Value | Units | Method | Reference | Comment |
---|---|---|---|---|---|
ΔfH°gas | -109.9 ± 2.9 | kJ/mol | Ccr | Bjellerup, 1961 |

Condensed phase thermochemistry data

Data compiled by: Hussein Y. Afeefy, Joel F. Liebman, and Stephen E. Stein
Quantity | Value | Units | Method | Reference | Comment |
---|---|---|---|---|---|
ΔfH°liquid | -160.5 ± 2.5 | kJ/mol | Ccr | Bjellerup, 1961 | |
Quantity | Value | Units | Method | Reference | Comment |
ΔcH°liquid | -3629.8 ± 2.5 | kJ/mol | Ccr | Bjellerup, 1961 |

Phase change data

Data compiled by: Hussein Y. Afeefy, Joel F. Liebman, and Stephen E. Stein
Enthalpy of vaporization
ΔvapH (kJ/mol) | Temperature (K) | Method | Reference |
---|---|---|---|
50.497 | 300. | V | Lister, 1941 |

Reaction thermochemistry data

Data compiled by: Hussein Y. Afeefy, Joel F. Liebman, and Stephen E. Stein
Individual Reactions
By formula: C6H10 + Br2 = C6H10Br2
Quantity | Value | Units | Method | Reference | Comment |
---|---|---|---|---|---|
ΔrH° | -140.71 | kJ/mol | Cm | Lister, 1941 | gas phase; Heat of bromination at 300 K |

References

Bjellerup, 1961
Bjellerup, L.,
On the accuracy of heat of combustion data obtained with a precision moving-bomb calorimetric method for organic bromine compounds,
Acta Chem. Scand., 1961, 15, 121-140. [all data]
Lister, 1941
Lister, M.W.,
Heats of organic reactions. X. Heats of bromination of cyclic olefins,
J. Am. Chem. Soc., 1941, 63, 143-149. [all data]