Hydrazine, 1,1-dimethyl-2-(1-methylpropyl)-
- Formula: C6H16N2
- Molecular weight: 116.2046
- IUPAC Standard InChIKey: JNQHRUNRCVMHQV-UHFFFAOYSA-N
- CAS Registry Number: 54007-24-8
- Chemical structure:
View 3d structure (requires JavaScript / HTML 5) - Other names: 1,1-Dimethyl-2-sec-butylhydrazine

Normal alkane RI, non-polar column, temperature ramp

Column type | Active phase | I | Reference | Comment |
---|---|---|---|---|
Capillary | OV-101 | 755. | Zenkevich, 2005 | 25. m/0.20 mm/0.10 μm, N2/He, 6. K/min; Tstart: 50. C; Tend: 250. C |

References

Zenkevich, 2005
Zenkevich, I.G.,
Experimentally measured retention indices., 2005. [all data]