Carbonic acid, bis(2-methylpropyl) ester
- Formula: C9H18O3
- Molecular weight: 174.2374
- IUPAC Standard InChIKey: UXXXZMDJQLPQPH-UHFFFAOYSA-N
- CAS Registry Number: 539-92-4
- Chemical structure:
View 3d structure (requires JavaScript / HTML 5) - Other names: Carbonic acid, diisobutyl ester; Diisobutyl carbonate; Isobutyl carbonate; (iso-C4H9O)2C(O)

Phase change data

Data compiled by: Thermodynamics Research Center, NIST Boulder Laboratories, Chris Muzny director
Quantity | Value | Units | Method | Reference | Comment |
---|---|---|---|---|---|
Tboil | 463.45 | K | N/A | Lecat, 1943 | Uncertainty assigned by TRC = 0.3 K |

References

Lecat, 1943
Lecat, M.,
Azeotropes of Ethyl Urethane and other Azeotropes,
C. R. Hebd. Seances Acad. Sci., 1943, 217, 273. [all data]