(S)-2,4-dimethylhexane
- Formula: C8H18
- Molecular weight: 114.2285
- IUPAC Standard InChIKey: HDGQICNBXPAKLR-MRVPVSSYSA-N
- CAS Registry Number: 53990-98-0
- Chemical structure:
View 3d structure (requires JavaScript / HTML 5) - Stereoisomers:

Phase change data

Data compiled by: Thermodynamics Research Center, NIST Boulder Laboratories, Chris Muzny director
Quantity | Value | Units | Method | Reference | Comment |
---|---|---|---|---|---|
Tboil | 383.65 | K | N/A | Levene and Marker, 1931 | Uncertainty assigned by TRC = 2. K |

References

Levene and Marker, 1931
Levene, P.A.; Marker, R.E.,
J. Biol. Chem., 1931, 91, 405. [all data]