2,3-Dibromopentane

Phase change data

Data compiled as indicated in comments:
BS - Robert L. Brown and Stephen E. Stein
TRC - Thermodynamics Research Center, NIST Boulder Laboratories, Chris Muzny director

Quantity Value Units Method Reference Comment
Tboil451.2KN/AWeast and Grasselli, 1989BS
Tboil452.KN/ASherrill, Baldwin, et al., 1929Uncertainty assigned by TRC = 2. K; TRC
Tboil455.KN/ASherrill, Baldwin, et al., 1929Uncertainty assigned by TRC = 5. K; TRC
Quantity Value Units Method Reference Comment
Tfus207.KN/AVan Risseghem, 1914Uncertainty assigned by TRC = 4. K; TRC

Reduced pressure boiling point

Tboil (K) Pressure (bar) Reference Comment
347.20.023Weast and Grasselli, 1989BS

In addition to the Thermodynamics Research Center (TRC) data available from this site, much more physical and chemical property data is available from the following TRC products:

References

Weast and Grasselli, 1989
CRC Handbook of Data on Organic Compounds, 2nd Editon, Weast,R.C and Grasselli, J.G., ed(s)., CRC Press, Inc., Boca Raton, FL, 1989, 1. [all data]

Sherrill, Baldwin, et al., 1929
Sherrill, M.L.; Baldwin, C.; Haas, D., Isomers of 2-pentene: II pentene-2 from 2-bromopentane and from 2-pentanol, J. Am. Chem. Soc., 1929, 51, 3034-41. [all data]

Van Risseghem, 1914
Van Risseghem, H., Beta-pentene and some of its derivatives, C. R. Hebd. Seances Acad. Sci., 1914, 158, 1694-8. [all data]