Heptafulvene
- Formula: C8H8
- Molecular weight: 104.1491
- IUPAC Standard InChIKey: GGKMDDDYCSVHMU-UHFFFAOYSA-N
- CAS Registry Number: 539-79-7
- Chemical structure:
View 3d structure (requires JavaScript / HTML 5) - Permanent link for this species. Use this link for bookmarking this species for future reference.

Reaction thermochemistry data

Data compiled by: Hussein Y. Afeefy, Joel F. Liebman, and Stephen E. Stein
Individual Reactions
By formula: 4H2 + C8H8 = C8H16
Quantity | Value | Units | Method | Reference | Comment |
---|---|---|---|---|---|
ΔrH° | -387.6 ± 1.7 | kJ/mol | Chyd | Turner, Meador, et al., 1957 | solid phase; solvent: Diethylcarbitol |

References

Turner, Meador, et al., 1957
Turner, R.B.; Meador, W.R.; Doering, W.E.; Knox, L.H.; Mayer, J.R.; Wiley, D.W.,
Heats of hydrogenation. III. Hydrogenation of cycllooctatetraene and of some seven-membered non-benzenoid aromatic compounds,
J. Am. Chem. Soc., 1957, 79, 4127-4133. [all data]