Carbamic acid, ethylidenebis-, diethyl ester

Condensed phase thermochemistry data

Data compiled by: Hussein Y. Afeefy, Joel F. Liebman, and Stephen E. Stein

Quantity Value Units Method Reference Comment
Δfsolid-234.4 ± 1.0kcal/molCcbMedard and Thomas, 1952Reanalyzed by Cox and Pilcher, 1970, Original value = -232.8 kcal/mol; Author's hf291_condensed=-236.9 kcal/mol
Quantity Value Units Method Reference Comment
Δcsolid-1064.5 ± 1.0kcal/molCcbMedard and Thomas, 1952Reanalyzed by Cox and Pilcher, 1970, Original value = -1066.1 kcal/mol; Author's hf291_condensed=-236.9 kcal/mol

References

Medard and Thomas, 1952
Medard, L.; Thomas, M., Determination des chaleurs de combustion de douze composes organiques utilises dans les poudres et enplosies, Mem. Poudres, 1952, 34, 421-442. [all data]

Cox and Pilcher, 1970
Cox, J.D.; Pilcher, G., Thermochemistry of Organic and Organometallic Compounds, Academic Press, New York, 1970, 1-636. [all data]